{"text_format":"1","workbook":"xlsx","n_sheets":6,"sheets":["Startup","Startup_data","Shutdown","Shutdown_data","Assemble","Asm"],"not_rendered":{"charts":2,"images":3,"macros":1,"external_links":0,"defined_names":3,"comments":0,"pivot_tables":0},"unopened":[],"bounds":{"document_bytes":16777216,"sheet_cells":100000,"rows_first":2000,"rows_last":500,"rows_between":2000,"halvings":0,"cell_chars":16384,"cell_head_chars":4096},"cells_cut":0,"cells_raw":0,"read":"whole","date_system":"1900"}

{"sheet":"Startup","index":0,"n_rows":9,"n_cols":26,"rows_kept":9,"cut":false,"hidden":false,"merged":[]}
[null,"Output name","Binary","Time0","State0","Time1","Change1","Time2","Change2","Time3","Change3","Time4","Change4","Time5","Change5","Time6","Change6","Time7","Change7","Time8","Change8","Time9","Change9","Time10","Change10","End state"]
[null,"Hold 12V",1,0,"Off",0.1,{"$f":"IF(F2=\"\",\"\",IF(E2=\"Off\",\"On\",\"Off\"))","v":"On"},null,{"$f":"IF(H2=\"\",\"\",IF(G2=\"Off\",\"On\",\"Off\"))","v":""},null,{"$f":"IF(J2=\"\",\"\",IF(I2=\"Off\",\"On\",\"Off\"))","v":""},null,{"$f":"IF(L2=\"\",\"\",IF(K2=\"Off\",\"On\",\"Off\"))","v":""},null,{"$f":"IF(N2=\"\",\"\",IF(M2=\"Off\",\"On\",\"Off\"))","v":""},null,{"$f":"IF(P2=\"\",\"\",IF(O2=\"Off\",\"On\",\"Off\"))","v":""},null,{"$f":"IF(R2=\"\",\"\",IF(Q2=\"Off\",\"On\",\"Off\"))","v":""},null,{"$f":"IF(T2=\"\",\"\",IF(S2=\"Off\",\"On\",\"Off\"))","v":""},null,{"$f":"IF(V2=\"\",\"\",IF(U2=\"Off\",\"On\",\"Off\"))","v":""},null,{"$f":"IF(X2=\"\",\"\",IF(W2=\"Off\",\"On\",\"Off\"))","v":""},{"$f":"IF(RIGHT(CONCATENATE(G2,I2,K2,M2,O2,Q2,S2,U2,W2,Y2),1)=\"n\",\"On\",\"Off\")","v":"On"}]
[null,"Motor open",2,0,"Off",1,{"$f":"IF(F3=\"\",\"\",IF(E3=\"Off\",\"On\",\"Off\"))","v":"On"},20,{"$f":"IF(H3=\"\",\"\",IF(G3=\"Off\",\"On\",\"Off\"))","v":"Off"},null,{"$f":"IF(J3=\"\",\"\",IF(I3=\"Off\",\"On\",\"Off\"))","v":""},null,{"$f":"IF(L3=\"\",\"\",IF(K3=\"Off\",\"On\",\"Off\"))","v":""},null,{"$f":"IF(N3=\"\",\"\",IF(M3=\"Off\",\"On\",\"Off\"))","v":""},null,{"$f":"IF(P3=\"\",\"\",IF(O3=\"Off\",\"On\",\"Off\"))","v":""},null,{"$f":"IF(R3=\"\",\"\",IF(Q3=\"Off\",\"On\",\"Off\"))","v":""},null,{"$f":"IF(T3=\"\",\"\",IF(S3=\"Off\",\"On\",\"Off\"))","v":""},null,{"$f":"IF(V3=\"\",\"\",IF(U3=\"Off\",\"On\",\"Off\"))","v":""},null,{"$f":"IF(X3=\"\",\"\",IF(W3=\"Off\",\"On\",\"Off\"))","v":""},{"$f":"IF(RIGHT(CONCATENATE(G3,I3,K3,M3,O3,Q3,S3,U3,W3,Y3),1)=\"n\",\"On\",\"Off\")","v":"Off"}]
[null,"Motor close",4,0,"Off",null,"",null,"",null,"",null,"",null,"",null,"",null,"",null,"",null,"",null,"","Off"]
[null,"Router power",8,0,"Off",1,"On",null,"",null,"",null,"",null,"",null,"",null,"",null,"",null,"",null,"","On"]
[null,"Router button",16,0,"Off",5,"On",8,"Off",null,"",null,"",null,"",null,"",null,"",null,"",null,"",null,"","Off"]
[null,"PLAY button",32,0,"Off",35,"On",35.5,"Off",38,"On",38.5,"Off",null,"",null,"",null,"",null,"",null,"",null,"","Off"]
[null,"REC button",64,0,"Off",36,"On",36.5,"Off",37,"On",37.5,"Off",null,"",null,"",null,"",null,"",null,"",null,"","Off"]
[null,"Tablet power",128,0,"Off",21,"On",null,"",null,"",null,"",null,"",null,"",null,"",null,"",null,"",null,"","On"]

{"sheet":"Startup_data","index":1,"n_rows":501,"n_cols":11,"rows_kept":501,"cut":false,"hidden":false,"merged":[]}
["Timestamp",{"$f":"Startup!B2","v":"Hold 12V"},{"$f":"Startup!B3","v":"Motor open"},{"$f":"Startup!B4","v":"Motor close"},{"$f":"Startup!B5","v":"Router power"},{"$f":"Startup!B6","v":"Router button"},{"$f":"Startup!B7","v":"PLAY button"},{"$f":"Startup!B8","v":"REC button"},{"$f":"Startup!B9","v":"Tablet power"},"Binary","Change"]
[0,0,2,4,6,8,10,12,14,{"$f":"IF(B2=0,0,Startup!$C$2)+IF(C2=2,0,Startup!$C$3)+IF(D2=4,0,Startup!$C$4)+IF(E2=6,0,Startup!$C$5)+IF(F2=8,0,Startup!$C$6)+IF(G2=10,0,Startup!$C$7)+IF(H2=12,0,Startup!$C$8)+IF(I2=14,0,Startup!$C$9)","v":0},{"$f":"IF(J2<>J1,\"Yes\",\"No\")","v":"Yes"}]
[0.1,1,2,4,6,8,10,12,14,{"$f":"IF(B3=0,0,Startup!$C$2)+IF(C3=2,0,Startup!$C$3)+IF(D3=4,0,Startup!$C$4)+IF(E3=6,0,Startup!$C$5)+IF(F3=8,0,Startup!$C$6)+IF(G3=10,0,Startup!$C$7)+IF(H3=12,0,Startup!$C$8)+IF(I3=14,0,Startup!$C$9)","v":1},{"$f":"IF(J3<>J2,\"Yes\",\"No\")","v":"Yes"}]
[0.2,1,2,4,6,8,10,12,14,{"$f":"IF(B4=0,0,Startup!$C$2)+IF(C4=2,0,Startup!$C$3)+IF(D4=4,0,Startup!$C$4)+IF(E4=6,0,Startup!$C$5)+IF(F4=8,0,Startup!$C$6)+IF(G4=10,0,Startup!$C$7)+IF(H4=12,0,Startup!$C$8)+IF(I4=14,0,Startup!$C$9)","v":1},{"$f":"IF(J4<>J3,\"Yes\",\"No\")","v":"No"}]
[0.3,1,2,4,6,8,10,12,14,{"$f":"IF(B5=0,0,Startup!$C$2)+IF(C5=2,0,Startup!$C$3)+IF(D5=4,0,Startup!$C$4)+IF(E5=6,0,Startup!$C$5)+IF(F5=8,0,Startup!$C$6)+IF(G5=10,0,Startup!$C$7)+IF(H5=12,0,Startup!$C$8)+IF(I5=14,0,Startup!$C$9)","v":1},"No"]
[0.4,1,2,4,6,8,10,12,14,{"$f":"IF(B6=0,0,Startup!$C$2)+IF(C6=2,0,Startup!$C$3)+IF(D6=4,0,Startup!$C$4)+IF(E6=6,0,Startup!$C$5)+IF(F6=8,0,Startup!$C$6)+IF(G6=10,0,Startup!$C$7)+IF(H6=12,0,Startup!$C$8)+IF(I6=14,0,Startup!$C$9)","v":1},"No"]
[0.5,1,2,4,6,8,10,12,14,{"$f":"IF(B7=0,0,Startup!$C$2)+IF(C7=2,0,Startup!$C$3)+IF(D7=4,0,Startup!$C$4)+IF(E7=6,0,Startup!$C$5)+IF(F7=8,0,Startup!$C$6)+IF(G7=10,0,Startup!$C$7)+IF(H7=12,0,Startup!$C$8)+IF(I7=14,0,Startup!$C$9)","v":1},"No"]
[0.6,1,2,4,6,8,10,12,14,{"$f":"IF(B8=0,0,Startup!$C$2)+IF(C8=2,0,Startup!$C$3)+IF(D8=4,0,Startup!$C$4)+IF(E8=6,0,Startup!$C$5)+IF(F8=8,0,Startup!$C$6)+IF(G8=10,0,Startup!$C$7)+IF(H8=12,0,Startup!$C$8)+IF(I8=14,0,Startup!$C$9)","v":1},"No"]
[0.7,1,2,4,6,8,10,12,14,{"$f":"IF(B9=0,0,Startup!$C$2)+IF(C9=2,0,Startup!$C$3)+IF(D9=4,0,Startup!$C$4)+IF(E9=6,0,Startup!$C$5)+IF(F9=8,0,Startup!$C$6)+IF(G9=10,0,Startup!$C$7)+IF(H9=12,0,Startup!$C$8)+IF(I9=14,0,Startup!$C$9)","v":1},"No"]
[0.8,1,2,4,6,8,10,12,14,{"$f":"IF(B10=0,0,Startup!$C$2)+IF(C10=2,0,Startup!$C$3)+IF(D10=4,0,Startup!$C$4)+IF(E10=6,0,Startup!$C$5)+IF(F10=8,0,Startup!$C$6)+IF(G10=10,0,Startup!$C$7)+IF(H10=12,0,Startup!$C$8)+IF(I10=14,0,Startup!$C$9)","v":1},"No"]
[0.9,1,2,4,6,8,10,12,14,{"$f":"IF(B11=0,0,Startup!$C$2)+IF(C11=2,0,Startup!$C$3)+IF(D11=4,0,Startup!$C$4)+IF(E11=6,0,Startup!$C$5)+IF(F11=8,0,Startup!$C$6)+IF(G11=10,0,Startup!$C$7)+IF(H11=12,0,Startup!$C$8)+IF(I11=14,0,Startup!$C$9)","v":1},"No"]
[1,1,3,4,7,8,10,12,14,{"$f":"IF(B12=0,0,Startup!$C$2)+IF(C12=2,0,Startup!$C$3)+IF(D12=4,0,Startup!$C$4)+IF(E12=6,0,Startup!$C$5)+IF(F12=8,0,Startup!$C$6)+IF(G12=10,0,Startup!$C$7)+IF(H12=12,0,Startup!$C$8)+IF(I12=14,0,Startup!$C$9)","v":11},"Yes"]
[1.1000000000000001,1,3,4,7,8,10,12,14,{"$f":"IF(B13=0,0,Startup!$C$2)+IF(C13=2,0,Startup!$C$3)+IF(D13=4,0,Startup!$C$4)+IF(E13=6,0,Startup!$C$5)+IF(F13=8,0,Startup!$C$6)+IF(G13=10,0,Startup!$C$7)+IF(H13=12,0,Startup!$C$8)+IF(I13=14,0,Startup!$C$9)","v":11},"No"]
[1.2,1,3,4,7,8,10,12,14,{"$f":"IF(B14=0,0,Startup!$C$2)+IF(C14=2,0,Startup!$C$3)+IF(D14=4,0,Startup!$C$4)+IF(E14=6,0,Startup!$C$5)+IF(F14=8,0,Startup!$C$6)+IF(G14=10,0,Startup!$C$7)+IF(H14=12,0,Startup!$C$8)+IF(I14=14,0,Startup!$C$9)","v":11},"No"]
[1.3,1,3,4,7,8,10,12,14,{"$f":"IF(B15=0,0,Startup!$C$2)+IF(C15=2,0,Startup!$C$3)+IF(D15=4,0,Startup!$C$4)+IF(E15=6,0,Startup!$C$5)+IF(F15=8,0,Startup!$C$6)+IF(G15=10,0,Startup!$C$7)+IF(H15=12,0,Startup!$C$8)+IF(I15=14,0,Startup!$C$9)","v":11},"No"]
[1.4,1,3,4,7,8,10,12,14,{"$f":"IF(B16=0,0,Startup!$C$2)+IF(C16=2,0,Startup!$C$3)+IF(D16=4,0,Startup!$C$4)+IF(E16=6,0,Startup!$C$5)+IF(F16=8,0,Startup!$C$6)+IF(G16=10,0,Startup!$C$7)+IF(H16=12,0,Startup!$C$8)+IF(I16=14,0,Startup!$C$9)","v":11},"No"]
[1.5,1,3,4,7,8,10,12,14,{"$f":"IF(B17=0,0,Startup!$C$2)+IF(C17=2,0,Startup!$C$3)+IF(D17=4,0,Startup!$C$4)+IF(E17=6,0,Startup!$C$5)+IF(F17=8,0,Startup!$C$6)+IF(G17=10,0,Startup!$C$7)+IF(H17=12,0,Startup!$C$8)+IF(I17=14,0,Startup!$C$9)","v":11},"No"]
[1.6,1,3,4,7,8,10,12,14,{"$f":"IF(B18=0,0,Startup!$C$2)+IF(C18=2,0,Startup!$C$3)+IF(D18=4,0,Startup!$C$4)+IF(E18=6,0,Startup!$C$5)+IF(F18=8,0,Startup!$C$6)+IF(G18=10,0,Startup!$C$7)+IF(H18=12,0,Startup!$C$8)+IF(I18=14,0,Startup!$C$9)","v":11},"No"]
[1.7,1,3,4,7,8,10,12,14,{"$f":"IF(B19=0,0,Startup!$C$2)+IF(C19=2,0,Startup!$C$3)+IF(D19=4,0,Startup!$C$4)+IF(E19=6,0,Startup!$C$5)+IF(F19=8,0,Startup!$C$6)+IF(G19=10,0,Startup!$C$7)+IF(H19=12,0,Startup!$C$8)+IF(I19=14,0,Startup!$C$9)","v":11},"No"]
[1.8,1,3,4,7,8,10,12,14,{"$f":"IF(B20=0,0,Startup!$C$2)+IF(C20=2,0,Startup!$C$3)+IF(D20=4,0,Startup!$C$4)+IF(E20=6,0,Startup!$C$5)+IF(F20=8,0,Startup!$C$6)+IF(G20=10,0,Startup!$C$7)+IF(H20=12,0,Startup!$C$8)+IF(I20=14,0,Startup!$C$9)","v":11},"No"]
[1.9,1,3,4,7,8,10,12,14,{"$f":"IF(B21=0,0,Startup!$C$2)+IF(C21=2,0,Startup!$C$3)+IF(D21=4,0,Startup!$C$4)+IF(E21=6,0,Startup!$C$5)+IF(F21=8,0,Startup!$C$6)+IF(G21=10,0,Startup!$C$7)+IF(H21=12,0,Startup!$C$8)+IF(I21=14,0,Startup!$C$9)","v":11},"No"]
[2,1,3,4,7,8,10,12,14,{"$f":"IF(B22=0,0,Startup!$C$2)+IF(C22=2,0,Startup!$C$3)+IF(D22=4,0,Startup!$C$4)+IF(E22=6,0,Startup!$C$5)+IF(F22=8,0,Startup!$C$6)+IF(G22=10,0,Startup!$C$7)+IF(H22=12,0,Startup!$C$8)+IF(I22=14,0,Startup!$C$9)","v":11},"No"]
[2.1,1,3,4,7,8,10,12,14,{"$f":"IF(B23=0,0,Startup!$C$2)+IF(C23=2,0,Startup!$C$3)+IF(D23=4,0,Startup!$C$4)+IF(E23=6,0,Startup!$C$5)+IF(F23=8,0,Startup!$C$6)+IF(G23=10,0,Startup!$C$7)+IF(H23=12,0,Startup!$C$8)+IF(I23=14,0,Startup!$C$9)","v":11},"No"]
[2.2000000000000002,1,3,4,7,8,10,12,14,{"$f":"IF(B24=0,0,Startup!$C$2)+IF(C24=2,0,Startup!$C$3)+IF(D24=4,0,Startup!$C$4)+IF(E24=6,0,Startup!$C$5)+IF(F24=8,0,Startup!$C$6)+IF(G24=10,0,Startup!$C$7)+IF(H24=12,0,Startup!$C$8)+IF(I24=14,0,Startup!$C$9)","v":11},"No"]
[2.2999999999999998,1,3,4,7,8,10,12,14,{"$f":"IF(B25=0,0,Startup!$C$2)+IF(C25=2,0,Startup!$C$3)+IF(D25=4,0,Startup!$C$4)+IF(E25=6,0,Startup!$C$5)+IF(F25=8,0,Startup!$C$6)+IF(G25=10,0,Startup!$C$7)+IF(H25=12,0,Startup!$C$8)+IF(I25=14,0,Startup!$C$9)","v":11},"No"]
[2.4,1,3,4,7,8,10,12,14,{"$f":"IF(B26=0,0,Startup!$C$2)+IF(C26=2,0,Startup!$C$3)+IF(D26=4,0,Startup!$C$4)+IF(E26=6,0,Startup!$C$5)+IF(F26=8,0,Startup!$C$6)+IF(G26=10,0,Startup!$C$7)+IF(H26=12,0,Startup!$C$8)+IF(I26=14,0,Startup!$C$9)","v":11},"No"]
[2.5,1,3,4,7,8,10,12,14,{"$f":"IF(B27=0,0,Startup!$C$2)+IF(C27=2,0,Startup!$C$3)+IF(D27=4,0,Startup!$C$4)+IF(E27=6,0,Startup!$C$5)+IF(F27=8,0,Startup!$C$6)+IF(G27=10,0,Startup!$C$7)+IF(H27=12,0,Startup!$C$8)+IF(I27=14,0,Startup!$C$9)","v":11},"No"]
[2.6,1,3,4,7,8,10,12,14,{"$f":"IF(B28=0,0,Startup!$C$2)+IF(C28=2,0,Startup!$C$3)+IF(D28=4,0,Startup!$C$4)+IF(E28=6,0,Startup!$C$5)+IF(F28=8,0,Startup!$C$6)+IF(G28=10,0,Startup!$C$7)+IF(H28=12,0,Startup!$C$8)+IF(I28=14,0,Startup!$C$9)","v":11},"No"]
[2.7,1,3,4,7,8,10,12,14,{"$f":"IF(B29=0,0,Startup!$C$2)+IF(C29=2,0,Startup!$C$3)+IF(D29=4,0,Startup!$C$4)+IF(E29=6,0,Startup!$C$5)+IF(F29=8,0,Startup!$C$6)+IF(G29=10,0,Startup!$C$7)+IF(H29=12,0,Startup!$C$8)+IF(I29=14,0,Startup!$C$9)","v":11},"No"]
[2.8,1,3,4,7,8,10,12,14,{"$f":"IF(B30=0,0,Startup!$C$2)+IF(C30=2,0,Startup!$C$3)+IF(D30=4,0,Startup!$C$4)+IF(E30=6,0,Startup!$C$5)+IF(F30=8,0,Startup!$C$6)+IF(G30=10,0,Startup!$C$7)+IF(H30=12,0,Startup!$C$8)+IF(I30=14,0,Startup!$C$9)","v":11},"No"]
[2.9,1,3,4,7,8,10,12,14,{"$f":"IF(B31=0,0,Startup!$C$2)+IF(C31=2,0,Startup!$C$3)+IF(D31=4,0,Startup!$C$4)+IF(E31=6,0,Startup!$C$5)+IF(F31=8,0,Startup!$C$6)+IF(G31=10,0,Startup!$C$7)+IF(H31=12,0,Startup!$C$8)+IF(I31=14,0,Startup!$C$9)","v":11},"No"]
[3,1,3,4,7,8,10,12,14,{"$f":"IF(B32=0,0,Startup!$C$2)+IF(C32=2,0,Startup!$C$3)+IF(D32=4,0,Startup!$C$4)+IF(E32=6,0,Startup!$C$5)+IF(F32=8,0,Startup!$C$6)+IF(G32=10,0,Startup!$C$7)+IF(H32=12,0,Startup!$C$8)+IF(I32=14,0,Startup!$C$9)","v":11},"No"]
[3.1,1,3,4,7,8,10,12,14,{"$f":"IF(B33=0,0,Startup!$C$2)+IF(C33=2,0,Startup!$C$3)+IF(D33=4,0,Startup!$C$4)+IF(E33=6,0,Startup!$C$5)+IF(F33=8,0,Startup!$C$6)+IF(G33=10,0,Startup!$C$7)+IF(H33=12,0,Startup!$C$8)+IF(I33=14,0,Startup!$C$9)","v":11},"No"]
[3.2,1,3,4,7,8,10,12,14,{"$f":"IF(B34=0,0,Startup!$C$2)+IF(C34=2,0,Startup!$C$3)+IF(D34=4,0,Startup!$C$4)+IF(E34=6,0,Startup!$C$5)+IF(F34=8,0,Startup!$C$6)+IF(G34=10,0,Startup!$C$7)+IF(H34=12,0,Startup!$C$8)+IF(I34=14,0,Startup!$C$9)","v":11},"No"]
[3.3,1,3,4,7,8,10,12,14,{"$f":"IF(B35=0,0,Startup!$C$2)+IF(C35=2,0,Startup!$C$3)+IF(D35=4,0,Startup!$C$4)+IF(E35=6,0,Startup!$C$5)+IF(F35=8,0,Startup!$C$6)+IF(G35=10,0,Startup!$C$7)+IF(H35=12,0,Startup!$C$8)+IF(I35=14,0,Startup!$C$9)","v":11},"No"]
[3.4,1,3,4,7,8,10,12,14,{"$f":"IF(B36=0,0,Startup!$C$2)+IF(C36=2,0,Startup!$C$3)+IF(D36=4,0,Startup!$C$4)+IF(E36=6,0,Startup!$C$5)+IF(F36=8,0,Startup!$C$6)+IF(G36=10,0,Startup!$C$7)+IF(H36=12,0,Startup!$C$8)+IF(I36=14,0,Startup!$C$9)","v":11},"No"]
[3.5,1,3,4,7,8,10,12,14,{"$f":"IF(B37=0,0,Startup!$C$2)+IF(C37=2,0,Startup!$C$3)+IF(D37=4,0,Startup!$C$4)+IF(E37=6,0,Startup!$C$5)+IF(F37=8,0,Startup!$C$6)+IF(G37=10,0,Startup!$C$7)+IF(H37=12,0,Startup!$C$8)+IF(I37=14,0,Startup!$C$9)","v":11},"No"]
[3.6,1,3,4,7,8,10,12,14,{"$f":"IF(B38=0,0,Startup!$C$2)+IF(C38=2,0,Startup!$C$3)+IF(D38=4,0,Startup!$C$4)+IF(E38=6,0,Startup!$C$5)+IF(F38=8,0,Startup!$C$6)+IF(G38=10,0,Startup!$C$7)+IF(H38=12,0,Startup!$C$8)+IF(I38=14,0,Startup!$C$9)","v":11},"No"]
[3.7,1,3,4,7,8,10,12,14,{"$f":"IF(B39=0,0,Startup!$C$2)+IF(C39=2,0,Startup!$C$3)+IF(D39=4,0,Startup!$C$4)+IF(E39=6,0,Startup!$C$5)+IF(F39=8,0,Startup!$C$6)+IF(G39=10,0,Startup!$C$7)+IF(H39=12,0,Startup!$C$8)+IF(I39=14,0,Startup!$C$9)","v":11},"No"]
[3.8,1,3,4,7,8,10,12,14,{"$f":"IF(B40=0,0,Startup!$C$2)+IF(C40=2,0,Startup!$C$3)+IF(D40=4,0,Startup!$C$4)+IF(E40=6,0,Startup!$C$5)+IF(F40=8,0,Startup!$C$6)+IF(G40=10,0,Startup!$C$7)+IF(H40=12,0,Startup!$C$8)+IF(I40=14,0,Startup!$C$9)","v":11},"No"]
[3.9,1,3,4,7,8,10,12,14,{"$f":"IF(B41=0,0,Startup!$C$2)+IF(C41=2,0,Startup!$C$3)+IF(D41=4,0,Startup!$C$4)+IF(E41=6,0,Startup!$C$5)+IF(F41=8,0,Startup!$C$6)+IF(G41=10,0,Startup!$C$7)+IF(H41=12,0,Startup!$C$8)+IF(I41=14,0,Startup!$C$9)","v":11},"No"]
[4,1,3,4,7,8,10,12,14,{"$f":"IF(B42=0,0,Startup!$C$2)+IF(C42=2,0,Startup!$C$3)+IF(D42=4,0,Startup!$C$4)+IF(E42=6,0,Startup!$C$5)+IF(F42=8,0,Startup!$C$6)+IF(G42=10,0,Startup!$C$7)+IF(H42=12,0,Startup!$C$8)+IF(I42=14,0,Startup!$C$9)","v":11},"No"]
[4.0999999999999996,1,3,4,7,8,10,12,14,{"$f":"IF(B43=0,0,Startup!$C$2)+IF(C43=2,0,Startup!$C$3)+IF(D43=4,0,Startup!$C$4)+IF(E43=6,0,Startup!$C$5)+IF(F43=8,0,Startup!$C$6)+IF(G43=10,0,Startup!$C$7)+IF(H43=12,0,Startup!$C$8)+IF(I43=14,0,Startup!$C$9)","v":11},"No"]
[4.2,1,3,4,7,8,10,12,14,{"$f":"IF(B44=0,0,Startup!$C$2)+IF(C44=2,0,Startup!$C$3)+IF(D44=4,0,Startup!$C$4)+IF(E44=6,0,Startup!$C$5)+IF(F44=8,0,Startup!$C$6)+IF(G44=10,0,Startup!$C$7)+IF(H44=12,0,Startup!$C$8)+IF(I44=14,0,Startup!$C$9)","v":11},"No"]
[4.3,1,3,4,7,8,10,12,14,{"$f":"IF(B45=0,0,Startup!$C$2)+IF(C45=2,0,Startup!$C$3)+IF(D45=4,0,Startup!$C$4)+IF(E45=6,0,Startup!$C$5)+IF(F45=8,0,Startup!$C$6)+IF(G45=10,0,Startup!$C$7)+IF(H45=12,0,Startup!$C$8)+IF(I45=14,0,Startup!$C$9)","v":11},"No"]
[4.4000000000000004,1,3,4,7,8,10,12,14,{"$f":"IF(B46=0,0,Startup!$C$2)+IF(C46=2,0,Startup!$C$3)+IF(D46=4,0,Startup!$C$4)+IF(E46=6,0,Startup!$C$5)+IF(F46=8,0,Startup!$C$6)+IF(G46=10,0,Startup!$C$7)+IF(H46=12,0,Startup!$C$8)+IF(I46=14,0,Startup!$C$9)","v":11},"No"]
[4.5,1,3,4,7,8,10,12,14,{"$f":"IF(B47=0,0,Startup!$C$2)+IF(C47=2,0,Startup!$C$3)+IF(D47=4,0,Startup!$C$4)+IF(E47=6,0,Startup!$C$5)+IF(F47=8,0,Startup!$C$6)+IF(G47=10,0,Startup!$C$7)+IF(H47=12,0,Startup!$C$8)+IF(I47=14,0,Startup!$C$9)","v":11},"No"]
[4.5999999999999996,1,3,4,7,8,10,12,14,{"$f":"IF(B48=0,0,Startup!$C$2)+IF(C48=2,0,Startup!$C$3)+IF(D48=4,0,Startup!$C$4)+IF(E48=6,0,Startup!$C$5)+IF(F48=8,0,Startup!$C$6)+IF(G48=10,0,Startup!$C$7)+IF(H48=12,0,Startup!$C$8)+IF(I48=14,0,Startup!$C$9)","v":11},"No"]
[4.7,1,3,4,7,8,10,12,14,{"$f":"IF(B49=0,0,Startup!$C$2)+IF(C49=2,0,Startup!$C$3)+IF(D49=4,0,Startup!$C$4)+IF(E49=6,0,Startup!$C$5)+IF(F49=8,0,Startup!$C$6)+IF(G49=10,0,Startup!$C$7)+IF(H49=12,0,Startup!$C$8)+IF(I49=14,0,Startup!$C$9)","v":11},"No"]
[4.8,1,3,4,7,8,10,12,14,{"$f":"IF(B50=0,0,Startup!$C$2)+IF(C50=2,0,Startup!$C$3)+IF(D50=4,0,Startup!$C$4)+IF(E50=6,0,Startup!$C$5)+IF(F50=8,0,Startup!$C$6)+IF(G50=10,0,Startup!$C$7)+IF(H50=12,0,Startup!$C$8)+IF(I50=14,0,Startup!$C$9)","v":11},"No"]
[4.9000000000000004,1,3,4,7,8,10,12,14,{"$f":"IF(B51=0,0,Startup!$C$2)+IF(C51=2,0,Startup!$C$3)+IF(D51=4,0,Startup!$C$4)+IF(E51=6,0,Startup!$C$5)+IF(F51=8,0,Startup!$C$6)+IF(G51=10,0,Startup!$C$7)+IF(H51=12,0,Startup!$C$8)+IF(I51=14,0,Startup!$C$9)","v":11},"No"]
[5,1,3,4,7,9,10,12,14,{"$f":"IF(B52=0,0,Startup!$C$2)+IF(C52=2,0,Startup!$C$3)+IF(D52=4,0,Startup!$C$4)+IF(E52=6,0,Startup!$C$5)+IF(F52=8,0,Startup!$C$6)+IF(G52=10,0,Startup!$C$7)+IF(H52=12,0,Startup!$C$8)+IF(I52=14,0,Startup!$C$9)","v":27},"Yes"]
[5.0999999999999996,1,3,4,7,9,10,12,14,{"$f":"IF(B53=0,0,Startup!$C$2)+IF(C53=2,0,Startup!$C$3)+IF(D53=4,0,Startup!$C$4)+IF(E53=6,0,Startup!$C$5)+IF(F53=8,0,Startup!$C$6)+IF(G53=10,0,Startup!$C$7)+IF(H53=12,0,Startup!$C$8)+IF(I53=14,0,Startup!$C$9)","v":27},"No"]
[5.2,1,3,4,7,9,10,12,14,{"$f":"IF(B54=0,0,Startup!$C$2)+IF(C54=2,0,Startup!$C$3)+IF(D54=4,0,Startup!$C$4)+IF(E54=6,0,Startup!$C$5)+IF(F54=8,0,Startup!$C$6)+IF(G54=10,0,Startup!$C$7)+IF(H54=12,0,Startup!$C$8)+IF(I54=14,0,Startup!$C$9)","v":27},"No"]
[5.3,1,3,4,7,9,10,12,14,{"$f":"IF(B55=0,0,Startup!$C$2)+IF(C55=2,0,Startup!$C$3)+IF(D55=4,0,Startup!$C$4)+IF(E55=6,0,Startup!$C$5)+IF(F55=8,0,Startup!$C$6)+IF(G55=10,0,Startup!$C$7)+IF(H55=12,0,Startup!$C$8)+IF(I55=14,0,Startup!$C$9)","v":27},"No"]
[5.4,1,3,4,7,9,10,12,14,{"$f":"IF(B56=0,0,Startup!$C$2)+IF(C56=2,0,Startup!$C$3)+IF(D56=4,0,Startup!$C$4)+IF(E56=6,0,Startup!$C$5)+IF(F56=8,0,Startup!$C$6)+IF(G56=10,0,Startup!$C$7)+IF(H56=12,0,Startup!$C$8)+IF(I56=14,0,Startup!$C$9)","v":27},"No"]
[5.5,1,3,4,7,9,10,12,14,{"$f":"IF(B57=0,0,Startup!$C$2)+IF(C57=2,0,Startup!$C$3)+IF(D57=4,0,Startup!$C$4)+IF(E57=6,0,Startup!$C$5)+IF(F57=8,0,Startup!$C$6)+IF(G57=10,0,Startup!$C$7)+IF(H57=12,0,Startup!$C$8)+IF(I57=14,0,Startup!$C$9)","v":27},"No"]
[5.6,1,3,4,7,9,10,12,14,{"$f":"IF(B58=0,0,Startup!$C$2)+IF(C58=2,0,Startup!$C$3)+IF(D58=4,0,Startup!$C$4)+IF(E58=6,0,Startup!$C$5)+IF(F58=8,0,Startup!$C$6)+IF(G58=10,0,Startup!$C$7)+IF(H58=12,0,Startup!$C$8)+IF(I58=14,0,Startup!$C$9)","v":27},"No"]
[5.7,1,3,4,7,9,10,12,14,{"$f":"IF(B59=0,0,Startup!$C$2)+IF(C59=2,0,Startup!$C$3)+IF(D59=4,0,Startup!$C$4)+IF(E59=6,0,Startup!$C$5)+IF(F59=8,0,Startup!$C$6)+IF(G59=10,0,Startup!$C$7)+IF(H59=12,0,Startup!$C$8)+IF(I59=14,0,Startup!$C$9)","v":27},"No"]
[5.8,1,3,4,7,9,10,12,14,{"$f":"IF(B60=0,0,Startup!$C$2)+IF(C60=2,0,Startup!$C$3)+IF(D60=4,0,Startup!$C$4)+IF(E60=6,0,Startup!$C$5)+IF(F60=8,0,Startup!$C$6)+IF(G60=10,0,Startup!$C$7)+IF(H60=12,0,Startup!$C$8)+IF(I60=14,0,Startup!$C$9)","v":27},"No"]
[5.9,1,3,4,7,9,10,12,14,{"$f":"IF(B61=0,0,Startup!$C$2)+IF(C61=2,0,Startup!$C$3)+IF(D61=4,0,Startup!$C$4)+IF(E61=6,0,Startup!$C$5)+IF(F61=8,0,Startup!$C$6)+IF(G61=10,0,Startup!$C$7)+IF(H61=12,0,Startup!$C$8)+IF(I61=14,0,Startup!$C$9)","v":27},"No"]
[6,1,3,4,7,9,10,12,14,{"$f":"IF(B62=0,0,Startup!$C$2)+IF(C62=2,0,Startup!$C$3)+IF(D62=4,0,Startup!$C$4)+IF(E62=6,0,Startup!$C$5)+IF(F62=8,0,Startup!$C$6)+IF(G62=10,0,Startup!$C$7)+IF(H62=12,0,Startup!$C$8)+IF(I62=14,0,Startup!$C$9)","v":27},"No"]
[6.1,1,3,4,7,9,10,12,14,{"$f":"IF(B63=0,0,Startup!$C$2)+IF(C63=2,0,Startup!$C$3)+IF(D63=4,0,Startup!$C$4)+IF(E63=6,0,Startup!$C$5)+IF(F63=8,0,Startup!$C$6)+IF(G63=10,0,Startup!$C$7)+IF(H63=12,0,Startup!$C$8)+IF(I63=14,0,Startup!$C$9)","v":27},"No"]
[6.2,1,3,4,7,9,10,12,14,{"$f":"IF(B64=0,0,Startup!$C$2)+IF(C64=2,0,Startup!$C$3)+IF(D64=4,0,Startup!$C$4)+IF(E64=6,0,Startup!$C$5)+IF(F64=8,0,Startup!$C$6)+IF(G64=10,0,Startup!$C$7)+IF(H64=12,0,Startup!$C$8)+IF(I64=14,0,Startup!$C$9)","v":27},"No"]
[6.3,1,3,4,7,9,10,12,14,{"$f":"IF(B65=0,0,Startup!$C$2)+IF(C65=2,0,Startup!$C$3)+IF(D65=4,0,Startup!$C$4)+IF(E65=6,0,Startup!$C$5)+IF(F65=8,0,Startup!$C$6)+IF(G65=10,0,Startup!$C$7)+IF(H65=12,0,Startup!$C$8)+IF(I65=14,0,Startup!$C$9)","v":27},"No"]
[6.4,1,3,4,7,9,10,12,14,{"$f":"IF(B66=0,0,Startup!$C$2)+IF(C66=2,0,Startup!$C$3)+IF(D66=4,0,Startup!$C$4)+IF(E66=6,0,Startup!$C$5)+IF(F66=8,0,Startup!$C$6)+IF(G66=10,0,Startup!$C$7)+IF(H66=12,0,Startup!$C$8)+IF(I66=14,0,Startup!$C$9)","v":27},"No"]
[6.5,1,3,4,7,9,10,12,14,{"$f":"IF(B67=0,0,Startup!$C$2)+IF(C67=2,0,Startup!$C$3)+IF(D67=4,0,Startup!$C$4)+IF(E67=6,0,Startup!$C$5)+IF(F67=8,0,Startup!$C$6)+IF(G67=10,0,Startup!$C$7)+IF(H67=12,0,Startup!$C$8)+IF(I67=14,0,Startup!$C$9)","v":27},"No"]
[6.6,1,3,4,7,9,10,12,14,{"$f":"IF(B68=0,0,Startup!$C$2)+IF(C68=2,0,Startup!$C$3)+IF(D68=4,0,Startup!$C$4)+IF(E68=6,0,Startup!$C$5)+IF(F68=8,0,Startup!$C$6)+IF(G68=10,0,Startup!$C$7)+IF(H68=12,0,Startup!$C$8)+IF(I68=14,0,Startup!$C$9)","v":27},{"$f":"IF(J68<>J67,\"Yes\",\"No\")","v":"No"}]
[6.7,1,3,4,7,9,10,12,14,{"$f":"IF(B69=0,0,Startup!$C$2)+IF(C69=2,0,Startup!$C$3)+IF(D69=4,0,Startup!$C$4)+IF(E69=6,0,Startup!$C$5)+IF(F69=8,0,Startup!$C$6)+IF(G69=10,0,Startup!$C$7)+IF(H69=12,0,Startup!$C$8)+IF(I69=14,0,Startup!$C$9)","v":27},"No"]
[6.8,1,3,4,7,9,10,12,14,{"$f":"IF(B70=0,0,Startup!$C$2)+IF(C70=2,0,Startup!$C$3)+IF(D70=4,0,Startup!$C$4)+IF(E70=6,0,Startup!$C$5)+IF(F70=8,0,Startup!$C$6)+IF(G70=10,0,Startup!$C$7)+IF(H70=12,0,Startup!$C$8)+IF(I70=14,0,Startup!$C$9)","v":27},"No"]
[6.9,1,3,4,7,9,10,12,14,{"$f":"IF(B71=0,0,Startup!$C$2)+IF(C71=2,0,Startup!$C$3)+IF(D71=4,0,Startup!$C$4)+IF(E71=6,0,Startup!$C$5)+IF(F71=8,0,Startup!$C$6)+IF(G71=10,0,Startup!$C$7)+IF(H71=12,0,Startup!$C$8)+IF(I71=14,0,Startup!$C$9)","v":27},"No"]
[7,1,3,4,7,9,10,12,14,{"$f":"IF(B72=0,0,Startup!$C$2)+IF(C72=2,0,Startup!$C$3)+IF(D72=4,0,Startup!$C$4)+IF(E72=6,0,Startup!$C$5)+IF(F72=8,0,Startup!$C$6)+IF(G72=10,0,Startup!$C$7)+IF(H72=12,0,Startup!$C$8)+IF(I72=14,0,Startup!$C$9)","v":27},"No"]
[7.1,1,3,4,7,9,10,12,14,{"$f":"IF(B73=0,0,Startup!$C$2)+IF(C73=2,0,Startup!$C$3)+IF(D73=4,0,Startup!$C$4)+IF(E73=6,0,Startup!$C$5)+IF(F73=8,0,Startup!$C$6)+IF(G73=10,0,Startup!$C$7)+IF(H73=12,0,Startup!$C$8)+IF(I73=14,0,Startup!$C$9)","v":27},"No"]
[7.2,1,3,4,7,9,10,12,14,{"$f":"IF(B74=0,0,Startup!$C$2)+IF(C74=2,0,Startup!$C$3)+IF(D74=4,0,Startup!$C$4)+IF(E74=6,0,Startup!$C$5)+IF(F74=8,0,Startup!$C$6)+IF(G74=10,0,Startup!$C$7)+IF(H74=12,0,Startup!$C$8)+IF(I74=14,0,Startup!$C$9)","v":27},"No"]
[7.3,1,3,4,7,9,10,12,14,{"$f":"IF(B75=0,0,Startup!$C$2)+IF(C75=2,0,Startup!$C$3)+IF(D75=4,0,Startup!$C$4)+IF(E75=6,0,Startup!$C$5)+IF(F75=8,0,Startup!$C$6)+IF(G75=10,0,Startup!$C$7)+IF(H75=12,0,Startup!$C$8)+IF(I75=14,0,Startup!$C$9)","v":27},"No"]
[7.4,1,3,4,7,9,10,12,14,{"$f":"IF(B76=0,0,Startup!$C$2)+IF(C76=2,0,Startup!$C$3)+IF(D76=4,0,Startup!$C$4)+IF(E76=6,0,Startup!$C$5)+IF(F76=8,0,Startup!$C$6)+IF(G76=10,0,Startup!$C$7)+IF(H76=12,0,Startup!$C$8)+IF(I76=14,0,Startup!$C$9)","v":27},"No"]
[7.5,1,3,4,7,9,10,12,14,{"$f":"IF(B77=0,0,Startup!$C$2)+IF(C77=2,0,Startup!$C$3)+IF(D77=4,0,Startup!$C$4)+IF(E77=6,0,Startup!$C$5)+IF(F77=8,0,Startup!$C$6)+IF(G77=10,0,Startup!$C$7)+IF(H77=12,0,Startup!$C$8)+IF(I77=14,0,Startup!$C$9)","v":27},"No"]
[7.6,1,3,4,7,9,10,12,14,{"$f":"IF(B78=0,0,Startup!$C$2)+IF(C78=2,0,Startup!$C$3)+IF(D78=4,0,Startup!$C$4)+IF(E78=6,0,Startup!$C$5)+IF(F78=8,0,Startup!$C$6)+IF(G78=10,0,Startup!$C$7)+IF(H78=12,0,Startup!$C$8)+IF(I78=14,0,Startup!$C$9)","v":27},"No"]
[7.7,1,3,4,7,9,10,12,14,{"$f":"IF(B79=0,0,Startup!$C$2)+IF(C79=2,0,Startup!$C$3)+IF(D79=4,0,Startup!$C$4)+IF(E79=6,0,Startup!$C$5)+IF(F79=8,0,Startup!$C$6)+IF(G79=10,0,Startup!$C$7)+IF(H79=12,0,Startup!$C$8)+IF(I79=14,0,Startup!$C$9)","v":27},"No"]
[7.8,1,3,4,7,9,10,12,14,{"$f":"IF(B80=0,0,Startup!$C$2)+IF(C80=2,0,Startup!$C$3)+IF(D80=4,0,Startup!$C$4)+IF(E80=6,0,Startup!$C$5)+IF(F80=8,0,Startup!$C$6)+IF(G80=10,0,Startup!$C$7)+IF(H80=12,0,Startup!$C$8)+IF(I80=14,0,Startup!$C$9)","v":27},"No"]
[7.9,1,3,4,7,9,10,12,14,{"$f":"IF(B81=0,0,Startup!$C$2)+IF(C81=2,0,Startup!$C$3)+IF(D81=4,0,Startup!$C$4)+IF(E81=6,0,Startup!$C$5)+IF(F81=8,0,Startup!$C$6)+IF(G81=10,0,Startup!$C$7)+IF(H81=12,0,Startup!$C$8)+IF(I81=14,0,Startup!$C$9)","v":27},"No"]
[8,1,3,4,7,8,10,12,14,{"$f":"IF(B82=0,0,Startup!$C$2)+IF(C82=2,0,Startup!$C$3)+IF(D82=4,0,Startup!$C$4)+IF(E82=6,0,Startup!$C$5)+IF(F82=8,0,Startup!$C$6)+IF(G82=10,0,Startup!$C$7)+IF(H82=12,0,Startup!$C$8)+IF(I82=14,0,Startup!$C$9)","v":11},"Yes"]
[8.1,1,3,4,7,8,10,12,14,{"$f":"IF(B83=0,0,Startup!$C$2)+IF(C83=2,0,Startup!$C$3)+IF(D83=4,0,Startup!$C$4)+IF(E83=6,0,Startup!$C$5)+IF(F83=8,0,Startup!$C$6)+IF(G83=10,0,Startup!$C$7)+IF(H83=12,0,Startup!$C$8)+IF(I83=14,0,Startup!$C$9)","v":11},"No"]
[8.1999999999999993,1,3,4,7,8,10,12,14,{"$f":"IF(B84=0,0,Startup!$C$2)+IF(C84=2,0,Startup!$C$3)+IF(D84=4,0,Startup!$C$4)+IF(E84=6,0,Startup!$C$5)+IF(F84=8,0,Startup!$C$6)+IF(G84=10,0,Startup!$C$7)+IF(H84=12,0,Startup!$C$8)+IF(I84=14,0,Startup!$C$9)","v":11},"No"]
[8.3000000000000007,1,3,4,7,8,10,12,14,{"$f":"IF(B85=0,0,Startup!$C$2)+IF(C85=2,0,Startup!$C$3)+IF(D85=4,0,Startup!$C$4)+IF(E85=6,0,Startup!$C$5)+IF(F85=8,0,Startup!$C$6)+IF(G85=10,0,Startup!$C$7)+IF(H85=12,0,Startup!$C$8)+IF(I85=14,0,Startup!$C$9)","v":11},"No"]
[8.4,1,3,4,7,8,10,12,14,{"$f":"IF(B86=0,0,Startup!$C$2)+IF(C86=2,0,Startup!$C$3)+IF(D86=4,0,Startup!$C$4)+IF(E86=6,0,Startup!$C$5)+IF(F86=8,0,Startup!$C$6)+IF(G86=10,0,Startup!$C$7)+IF(H86=12,0,Startup!$C$8)+IF(I86=14,0,Startup!$C$9)","v":11},"No"]
[8.5,1,3,4,7,8,10,12,14,{"$f":"IF(B87=0,0,Startup!$C$2)+IF(C87=2,0,Startup!$C$3)+IF(D87=4,0,Startup!$C$4)+IF(E87=6,0,Startup!$C$5)+IF(F87=8,0,Startup!$C$6)+IF(G87=10,0,Startup!$C$7)+IF(H87=12,0,Startup!$C$8)+IF(I87=14,0,Startup!$C$9)","v":11},"No"]
[8.6,1,3,4,7,8,10,12,14,{"$f":"IF(B88=0,0,Startup!$C$2)+IF(C88=2,0,Startup!$C$3)+IF(D88=4,0,Startup!$C$4)+IF(E88=6,0,Startup!$C$5)+IF(F88=8,0,Startup!$C$6)+IF(G88=10,0,Startup!$C$7)+IF(H88=12,0,Startup!$C$8)+IF(I88=14,0,Startup!$C$9)","v":11},"No"]
[8.6999999999999993,1,3,4,7,8,10,12,14,{"$f":"IF(B89=0,0,Startup!$C$2)+IF(C89=2,0,Startup!$C$3)+IF(D89=4,0,Startup!$C$4)+IF(E89=6,0,Startup!$C$5)+IF(F89=8,0,Startup!$C$6)+IF(G89=10,0,Startup!$C$7)+IF(H89=12,0,Startup!$C$8)+IF(I89=14,0,Startup!$C$9)","v":11},"No"]
[8.8000000000000007,1,3,4,7,8,10,12,14,{"$f":"IF(B90=0,0,Startup!$C$2)+IF(C90=2,0,Startup!$C$3)+IF(D90=4,0,Startup!$C$4)+IF(E90=6,0,Startup!$C$5)+IF(F90=8,0,Startup!$C$6)+IF(G90=10,0,Startup!$C$7)+IF(H90=12,0,Startup!$C$8)+IF(I90=14,0,Startup!$C$9)","v":11},"No"]
[8.9,1,3,4,7,8,10,12,14,{"$f":"IF(B91=0,0,Startup!$C$2)+IF(C91=2,0,Startup!$C$3)+IF(D91=4,0,Startup!$C$4)+IF(E91=6,0,Startup!$C$5)+IF(F91=8,0,Startup!$C$6)+IF(G91=10,0,Startup!$C$7)+IF(H91=12,0,Startup!$C$8)+IF(I91=14,0,Startup!$C$9)","v":11},"No"]
[9,1,3,4,7,8,10,12,14,{"$f":"IF(B92=0,0,Startup!$C$2)+IF(C92=2,0,Startup!$C$3)+IF(D92=4,0,Startup!$C$4)+IF(E92=6,0,Startup!$C$5)+IF(F92=8,0,Startup!$C$6)+IF(G92=10,0,Startup!$C$7)+IF(H92=12,0,Startup!$C$8)+IF(I92=14,0,Startup!$C$9)","v":11},"No"]
[9.1,1,3,4,7,8,10,12,14,{"$f":"IF(B93=0,0,Startup!$C$2)+IF(C93=2,0,Startup!$C$3)+IF(D93=4,0,Startup!$C$4)+IF(E93=6,0,Startup!$C$5)+IF(F93=8,0,Startup!$C$6)+IF(G93=10,0,Startup!$C$7)+IF(H93=12,0,Startup!$C$8)+IF(I93=14,0,Startup!$C$9)","v":11},"No"]
[9.1999999999999993,1,3,4,7,8,10,12,14,{"$f":"IF(B94=0,0,Startup!$C$2)+IF(C94=2,0,Startup!$C$3)+IF(D94=4,0,Startup!$C$4)+IF(E94=6,0,Startup!$C$5)+IF(F94=8,0,Startup!$C$6)+IF(G94=10,0,Startup!$C$7)+IF(H94=12,0,Startup!$C$8)+IF(I94=14,0,Startup!$C$9)","v":11},"No"]
[9.3000000000000007,1,3,4,7,8,10,12,14,{"$f":"IF(B95=0,0,Startup!$C$2)+IF(C95=2,0,Startup!$C$3)+IF(D95=4,0,Startup!$C$4)+IF(E95=6,0,Startup!$C$5)+IF(F95=8,0,Startup!$C$6)+IF(G95=10,0,Startup!$C$7)+IF(H95=12,0,Startup!$C$8)+IF(I95=14,0,Startup!$C$9)","v":11},"No"]
[9.4,1,3,4,7,8,10,12,14,{"$f":"IF(B96=0,0,Startup!$C$2)+IF(C96=2,0,Startup!$C$3)+IF(D96=4,0,Startup!$C$4)+IF(E96=6,0,Startup!$C$5)+IF(F96=8,0,Startup!$C$6)+IF(G96=10,0,Startup!$C$7)+IF(H96=12,0,Startup!$C$8)+IF(I96=14,0,Startup!$C$9)","v":11},"No"]
[9.5,1,3,4,7,8,10,12,14,{"$f":"IF(B97=0,0,Startup!$C$2)+IF(C97=2,0,Startup!$C$3)+IF(D97=4,0,Startup!$C$4)+IF(E97=6,0,Startup!$C$5)+IF(F97=8,0,Startup!$C$6)+IF(G97=10,0,Startup!$C$7)+IF(H97=12,0,Startup!$C$8)+IF(I97=14,0,Startup!$C$9)","v":11},"No"]
[9.6,1,3,4,7,8,10,12,14,{"$f":"IF(B98=0,0,Startup!$C$2)+IF(C98=2,0,Startup!$C$3)+IF(D98=4,0,Startup!$C$4)+IF(E98=6,0,Startup!$C$5)+IF(F98=8,0,Startup!$C$6)+IF(G98=10,0,Startup!$C$7)+IF(H98=12,0,Startup!$C$8)+IF(I98=14,0,Startup!$C$9)","v":11},"No"]
[9.6999999999999993,1,3,4,7,8,10,12,14,{"$f":"IF(B99=0,0,Startup!$C$2)+IF(C99=2,0,Startup!$C$3)+IF(D99=4,0,Startup!$C$4)+IF(E99=6,0,Startup!$C$5)+IF(F99=8,0,Startup!$C$6)+IF(G99=10,0,Startup!$C$7)+IF(H99=12,0,Startup!$C$8)+IF(I99=14,0,Startup!$C$9)","v":11},"No"]
[9.8000000000000007,1,3,4,7,8,10,12,14,{"$f":"IF(B100=0,0,Startup!$C$2)+IF(C100=2,0,Startup!$C$3)+IF(D100=4,0,Startup!$C$4)+IF(E100=6,0,Startup!$C$5)+IF(F100=8,0,Startup!$C$6)+IF(G100=10,0,Startup!$C$7)+IF(H100=12,0,Startup!$C$8)+IF(I100=14,0,Startup!$C$9)","v":11},"No"]
[9.9,1,3,4,7,8,10,12,14,{"$f":"IF(B101=0,0,Startup!$C$2)+IF(C101=2,0,Startup!$C$3)+IF(D101=4,0,Startup!$C$4)+IF(E101=6,0,Startup!$C$5)+IF(F101=8,0,Startup!$C$6)+IF(G101=10,0,Startup!$C$7)+IF(H101=12,0,Startup!$C$8)+IF(I101=14,0,Startup!$C$9)","v":11},"No"]
[10,1,3,4,7,8,10,12,14,{"$f":"IF(B102=0,0,Startup!$C$2)+IF(C102=2,0,Startup!$C$3)+IF(D102=4,0,Startup!$C$4)+IF(E102=6,0,Startup!$C$5)+IF(F102=8,0,Startup!$C$6)+IF(G102=10,0,Startup!$C$7)+IF(H102=12,0,Startup!$C$8)+IF(I102=14,0,Startup!$C$9)","v":11},"No"]
[10.1,1,3,4,7,8,10,12,14,{"$f":"IF(B103=0,0,Startup!$C$2)+IF(C103=2,0,Startup!$C$3)+IF(D103=4,0,Startup!$C$4)+IF(E103=6,0,Startup!$C$5)+IF(F103=8,0,Startup!$C$6)+IF(G103=10,0,Startup!$C$7)+IF(H103=12,0,Startup!$C$8)+IF(I103=14,0,Startup!$C$9)","v":11},"No"]
[10.199999999999999,1,3,4,7,8,10,12,14,{"$f":"IF(B104=0,0,Startup!$C$2)+IF(C104=2,0,Startup!$C$3)+IF(D104=4,0,Startup!$C$4)+IF(E104=6,0,Startup!$C$5)+IF(F104=8,0,Startup!$C$6)+IF(G104=10,0,Startup!$C$7)+IF(H104=12,0,Startup!$C$8)+IF(I104=14,0,Startup!$C$9)","v":11},"No"]
[10.3,1,3,4,7,8,10,12,14,{"$f":"IF(B105=0,0,Startup!$C$2)+IF(C105=2,0,Startup!$C$3)+IF(D105=4,0,Startup!$C$4)+IF(E105=6,0,Startup!$C$5)+IF(F105=8,0,Startup!$C$6)+IF(G105=10,0,Startup!$C$7)+IF(H105=12,0,Startup!$C$8)+IF(I105=14,0,Startup!$C$9)","v":11},"No"]
[10.4,1,3,4,7,8,10,12,14,{"$f":"IF(B106=0,0,Startup!$C$2)+IF(C106=2,0,Startup!$C$3)+IF(D106=4,0,Startup!$C$4)+IF(E106=6,0,Startup!$C$5)+IF(F106=8,0,Startup!$C$6)+IF(G106=10,0,Startup!$C$7)+IF(H106=12,0,Startup!$C$8)+IF(I106=14,0,Startup!$C$9)","v":11},"No"]
[10.5,1,3,4,7,8,10,12,14,{"$f":"IF(B107=0,0,Startup!$C$2)+IF(C107=2,0,Startup!$C$3)+IF(D107=4,0,Startup!$C$4)+IF(E107=6,0,Startup!$C$5)+IF(F107=8,0,Startup!$C$6)+IF(G107=10,0,Startup!$C$7)+IF(H107=12,0,Startup!$C$8)+IF(I107=14,0,Startup!$C$9)","v":11},"No"]
[10.6,1,3,4,7,8,10,12,14,{"$f":"IF(B108=0,0,Startup!$C$2)+IF(C108=2,0,Startup!$C$3)+IF(D108=4,0,Startup!$C$4)+IF(E108=6,0,Startup!$C$5)+IF(F108=8,0,Startup!$C$6)+IF(G108=10,0,Startup!$C$7)+IF(H108=12,0,Startup!$C$8)+IF(I108=14,0,Startup!$C$9)","v":11},"No"]
[10.7,1,3,4,7,8,10,12,14,{"$f":"IF(B109=0,0,Startup!$C$2)+IF(C109=2,0,Startup!$C$3)+IF(D109=4,0,Startup!$C$4)+IF(E109=6,0,Startup!$C$5)+IF(F109=8,0,Startup!$C$6)+IF(G109=10,0,Startup!$C$7)+IF(H109=12,0,Startup!$C$8)+IF(I109=14,0,Startup!$C$9)","v":11},"No"]
[10.8,1,3,4,7,8,10,12,14,{"$f":"IF(B110=0,0,Startup!$C$2)+IF(C110=2,0,Startup!$C$3)+IF(D110=4,0,Startup!$C$4)+IF(E110=6,0,Startup!$C$5)+IF(F110=8,0,Startup!$C$6)+IF(G110=10,0,Startup!$C$7)+IF(H110=12,0,Startup!$C$8)+IF(I110=14,0,Startup!$C$9)","v":11},"No"]
[10.9,1,3,4,7,8,10,12,14,{"$f":"IF(B111=0,0,Startup!$C$2)+IF(C111=2,0,Startup!$C$3)+IF(D111=4,0,Startup!$C$4)+IF(E111=6,0,Startup!$C$5)+IF(F111=8,0,Startup!$C$6)+IF(G111=10,0,Startup!$C$7)+IF(H111=12,0,Startup!$C$8)+IF(I111=14,0,Startup!$C$9)","v":11},"No"]
[11,1,3,4,7,8,10,12,14,{"$f":"IF(B112=0,0,Startup!$C$2)+IF(C112=2,0,Startup!$C$3)+IF(D112=4,0,Startup!$C$4)+IF(E112=6,0,Startup!$C$5)+IF(F112=8,0,Startup!$C$6)+IF(G112=10,0,Startup!$C$7)+IF(H112=12,0,Startup!$C$8)+IF(I112=14,0,Startup!$C$9)","v":11},"No"]
[11.1,1,3,4,7,8,10,12,14,{"$f":"IF(B113=0,0,Startup!$C$2)+IF(C113=2,0,Startup!$C$3)+IF(D113=4,0,Startup!$C$4)+IF(E113=6,0,Startup!$C$5)+IF(F113=8,0,Startup!$C$6)+IF(G113=10,0,Startup!$C$7)+IF(H113=12,0,Startup!$C$8)+IF(I113=14,0,Startup!$C$9)","v":11},"No"]
[11.2,1,3,4,7,8,10,12,14,{"$f":"IF(B114=0,0,Startup!$C$2)+IF(C114=2,0,Startup!$C$3)+IF(D114=4,0,Startup!$C$4)+IF(E114=6,0,Startup!$C$5)+IF(F114=8,0,Startup!$C$6)+IF(G114=10,0,Startup!$C$7)+IF(H114=12,0,Startup!$C$8)+IF(I114=14,0,Startup!$C$9)","v":11},"No"]
[11.3,1,3,4,7,8,10,12,14,{"$f":"IF(B115=0,0,Startup!$C$2)+IF(C115=2,0,Startup!$C$3)+IF(D115=4,0,Startup!$C$4)+IF(E115=6,0,Startup!$C$5)+IF(F115=8,0,Startup!$C$6)+IF(G115=10,0,Startup!$C$7)+IF(H115=12,0,Startup!$C$8)+IF(I115=14,0,Startup!$C$9)","v":11},"No"]
[11.4,1,3,4,7,8,10,12,14,{"$f":"IF(B116=0,0,Startup!$C$2)+IF(C116=2,0,Startup!$C$3)+IF(D116=4,0,Startup!$C$4)+IF(E116=6,0,Startup!$C$5)+IF(F116=8,0,Startup!$C$6)+IF(G116=10,0,Startup!$C$7)+IF(H116=12,0,Startup!$C$8)+IF(I116=14,0,Startup!$C$9)","v":11},"No"]
[11.5,1,3,4,7,8,10,12,14,{"$f":"IF(B117=0,0,Startup!$C$2)+IF(C117=2,0,Startup!$C$3)+IF(D117=4,0,Startup!$C$4)+IF(E117=6,0,Startup!$C$5)+IF(F117=8,0,Startup!$C$6)+IF(G117=10,0,Startup!$C$7)+IF(H117=12,0,Startup!$C$8)+IF(I117=14,0,Startup!$C$9)","v":11},"No"]
[11.6,1,3,4,7,8,10,12,14,{"$f":"IF(B118=0,0,Startup!$C$2)+IF(C118=2,0,Startup!$C$3)+IF(D118=4,0,Startup!$C$4)+IF(E118=6,0,Startup!$C$5)+IF(F118=8,0,Startup!$C$6)+IF(G118=10,0,Startup!$C$7)+IF(H118=12,0,Startup!$C$8)+IF(I118=14,0,Startup!$C$9)","v":11},"No"]
[11.7,1,3,4,7,8,10,12,14,{"$f":"IF(B119=0,0,Startup!$C$2)+IF(C119=2,0,Startup!$C$3)+IF(D119=4,0,Startup!$C$4)+IF(E119=6,0,Startup!$C$5)+IF(F119=8,0,Startup!$C$6)+IF(G119=10,0,Startup!$C$7)+IF(H119=12,0,Startup!$C$8)+IF(I119=14,0,Startup!$C$9)","v":11},"No"]
[11.8,1,3,4,7,8,10,12,14,{"$f":"IF(B120=0,0,Startup!$C$2)+IF(C120=2,0,Startup!$C$3)+IF(D120=4,0,Startup!$C$4)+IF(E120=6,0,Startup!$C$5)+IF(F120=8,0,Startup!$C$6)+IF(G120=10,0,Startup!$C$7)+IF(H120=12,0,Startup!$C$8)+IF(I120=14,0,Startup!$C$9)","v":11},"No"]
[11.9,1,3,4,7,8,10,12,14,{"$f":"IF(B121=0,0,Startup!$C$2)+IF(C121=2,0,Startup!$C$3)+IF(D121=4,0,Startup!$C$4)+IF(E121=6,0,Startup!$C$5)+IF(F121=8,0,Startup!$C$6)+IF(G121=10,0,Startup!$C$7)+IF(H121=12,0,Startup!$C$8)+IF(I121=14,0,Startup!$C$9)","v":11},"No"]
[12,1,3,4,7,8,10,12,14,{"$f":"IF(B122=0,0,Startup!$C$2)+IF(C122=2,0,Startup!$C$3)+IF(D122=4,0,Startup!$C$4)+IF(E122=6,0,Startup!$C$5)+IF(F122=8,0,Startup!$C$6)+IF(G122=10,0,Startup!$C$7)+IF(H122=12,0,Startup!$C$8)+IF(I122=14,0,Startup!$C$9)","v":11},"No"]
[12.1,1,3,4,7,8,10,12,14,{"$f":"IF(B123=0,0,Startup!$C$2)+IF(C123=2,0,Startup!$C$3)+IF(D123=4,0,Startup!$C$4)+IF(E123=6,0,Startup!$C$5)+IF(F123=8,0,Startup!$C$6)+IF(G123=10,0,Startup!$C$7)+IF(H123=12,0,Startup!$C$8)+IF(I123=14,0,Startup!$C$9)","v":11},"No"]
[12.2,1,3,4,7,8,10,12,14,{"$f":"IF(B124=0,0,Startup!$C$2)+IF(C124=2,0,Startup!$C$3)+IF(D124=4,0,Startup!$C$4)+IF(E124=6,0,Startup!$C$5)+IF(F124=8,0,Startup!$C$6)+IF(G124=10,0,Startup!$C$7)+IF(H124=12,0,Startup!$C$8)+IF(I124=14,0,Startup!$C$9)","v":11},"No"]
[12.3,1,3,4,7,8,10,12,14,{"$f":"IF(B125=0,0,Startup!$C$2)+IF(C125=2,0,Startup!$C$3)+IF(D125=4,0,Startup!$C$4)+IF(E125=6,0,Startup!$C$5)+IF(F125=8,0,Startup!$C$6)+IF(G125=10,0,Startup!$C$7)+IF(H125=12,0,Startup!$C$8)+IF(I125=14,0,Startup!$C$9)","v":11},"No"]
[12.4,1,3,4,7,8,10,12,14,{"$f":"IF(B126=0,0,Startup!$C$2)+IF(C126=2,0,Startup!$C$3)+IF(D126=4,0,Startup!$C$4)+IF(E126=6,0,Startup!$C$5)+IF(F126=8,0,Startup!$C$6)+IF(G126=10,0,Startup!$C$7)+IF(H126=12,0,Startup!$C$8)+IF(I126=14,0,Startup!$C$9)","v":11},"No"]
[12.5,1,3,4,7,8,10,12,14,{"$f":"IF(B127=0,0,Startup!$C$2)+IF(C127=2,0,Startup!$C$3)+IF(D127=4,0,Startup!$C$4)+IF(E127=6,0,Startup!$C$5)+IF(F127=8,0,Startup!$C$6)+IF(G127=10,0,Startup!$C$7)+IF(H127=12,0,Startup!$C$8)+IF(I127=14,0,Startup!$C$9)","v":11},"No"]
[12.6,1,3,4,7,8,10,12,14,{"$f":"IF(B128=0,0,Startup!$C$2)+IF(C128=2,0,Startup!$C$3)+IF(D128=4,0,Startup!$C$4)+IF(E128=6,0,Startup!$C$5)+IF(F128=8,0,Startup!$C$6)+IF(G128=10,0,Startup!$C$7)+IF(H128=12,0,Startup!$C$8)+IF(I128=14,0,Startup!$C$9)","v":11},"No"]
[12.7,1,3,4,7,8,10,12,14,{"$f":"IF(B129=0,0,Startup!$C$2)+IF(C129=2,0,Startup!$C$3)+IF(D129=4,0,Startup!$C$4)+IF(E129=6,0,Startup!$C$5)+IF(F129=8,0,Startup!$C$6)+IF(G129=10,0,Startup!$C$7)+IF(H129=12,0,Startup!$C$8)+IF(I129=14,0,Startup!$C$9)","v":11},"No"]
[12.8,1,3,4,7,8,10,12,14,{"$f":"IF(B130=0,0,Startup!$C$2)+IF(C130=2,0,Startup!$C$3)+IF(D130=4,0,Startup!$C$4)+IF(E130=6,0,Startup!$C$5)+IF(F130=8,0,Startup!$C$6)+IF(G130=10,0,Startup!$C$7)+IF(H130=12,0,Startup!$C$8)+IF(I130=14,0,Startup!$C$9)","v":11},"No"]
[12.9,1,3,4,7,8,10,12,14,{"$f":"IF(B131=0,0,Startup!$C$2)+IF(C131=2,0,Startup!$C$3)+IF(D131=4,0,Startup!$C$4)+IF(E131=6,0,Startup!$C$5)+IF(F131=8,0,Startup!$C$6)+IF(G131=10,0,Startup!$C$7)+IF(H131=12,0,Startup!$C$8)+IF(I131=14,0,Startup!$C$9)","v":11},"No"]
[13,1,3,4,7,8,10,12,14,{"$f":"IF(B132=0,0,Startup!$C$2)+IF(C132=2,0,Startup!$C$3)+IF(D132=4,0,Startup!$C$4)+IF(E132=6,0,Startup!$C$5)+IF(F132=8,0,Startup!$C$6)+IF(G132=10,0,Startup!$C$7)+IF(H132=12,0,Startup!$C$8)+IF(I132=14,0,Startup!$C$9)","v":11},{"$f":"IF(J132<>J131,\"Yes\",\"No\")","v":"No"}]
[13.1,1,3,4,7,8,10,12,14,{"$f":"IF(B133=0,0,Startup!$C$2)+IF(C133=2,0,Startup!$C$3)+IF(D133=4,0,Startup!$C$4)+IF(E133=6,0,Startup!$C$5)+IF(F133=8,0,Startup!$C$6)+IF(G133=10,0,Startup!$C$7)+IF(H133=12,0,Startup!$C$8)+IF(I133=14,0,Startup!$C$9)","v":11},"No"]
[13.2,1,3,4,7,8,10,12,14,{"$f":"IF(B134=0,0,Startup!$C$2)+IF(C134=2,0,Startup!$C$3)+IF(D134=4,0,Startup!$C$4)+IF(E134=6,0,Startup!$C$5)+IF(F134=8,0,Startup!$C$6)+IF(G134=10,0,Startup!$C$7)+IF(H134=12,0,Startup!$C$8)+IF(I134=14,0,Startup!$C$9)","v":11},"No"]
[13.3,1,3,4,7,8,10,12,14,{"$f":"IF(B135=0,0,Startup!$C$2)+IF(C135=2,0,Startup!$C$3)+IF(D135=4,0,Startup!$C$4)+IF(E135=6,0,Startup!$C$5)+IF(F135=8,0,Startup!$C$6)+IF(G135=10,0,Startup!$C$7)+IF(H135=12,0,Startup!$C$8)+IF(I135=14,0,Startup!$C$9)","v":11},"No"]
[13.4,1,3,4,7,8,10,12,14,{"$f":"IF(B136=0,0,Startup!$C$2)+IF(C136=2,0,Startup!$C$3)+IF(D136=4,0,Startup!$C$4)+IF(E136=6,0,Startup!$C$5)+IF(F136=8,0,Startup!$C$6)+IF(G136=10,0,Startup!$C$7)+IF(H136=12,0,Startup!$C$8)+IF(I136=14,0,Startup!$C$9)","v":11},"No"]
[13.5,1,3,4,7,8,10,12,14,{"$f":"IF(B137=0,0,Startup!$C$2)+IF(C137=2,0,Startup!$C$3)+IF(D137=4,0,Startup!$C$4)+IF(E137=6,0,Startup!$C$5)+IF(F137=8,0,Startup!$C$6)+IF(G137=10,0,Startup!$C$7)+IF(H137=12,0,Startup!$C$8)+IF(I137=14,0,Startup!$C$9)","v":11},"No"]
[13.6,1,3,4,7,8,10,12,14,{"$f":"IF(B138=0,0,Startup!$C$2)+IF(C138=2,0,Startup!$C$3)+IF(D138=4,0,Startup!$C$4)+IF(E138=6,0,Startup!$C$5)+IF(F138=8,0,Startup!$C$6)+IF(G138=10,0,Startup!$C$7)+IF(H138=12,0,Startup!$C$8)+IF(I138=14,0,Startup!$C$9)","v":11},"No"]
[13.7,1,3,4,7,8,10,12,14,{"$f":"IF(B139=0,0,Startup!$C$2)+IF(C139=2,0,Startup!$C$3)+IF(D139=4,0,Startup!$C$4)+IF(E139=6,0,Startup!$C$5)+IF(F139=8,0,Startup!$C$6)+IF(G139=10,0,Startup!$C$7)+IF(H139=12,0,Startup!$C$8)+IF(I139=14,0,Startup!$C$9)","v":11},"No"]
[13.8,1,3,4,7,8,10,12,14,{"$f":"IF(B140=0,0,Startup!$C$2)+IF(C140=2,0,Startup!$C$3)+IF(D140=4,0,Startup!$C$4)+IF(E140=6,0,Startup!$C$5)+IF(F140=8,0,Startup!$C$6)+IF(G140=10,0,Startup!$C$7)+IF(H140=12,0,Startup!$C$8)+IF(I140=14,0,Startup!$C$9)","v":11},"No"]
[13.9,1,3,4,7,8,10,12,14,{"$f":"IF(B141=0,0,Startup!$C$2)+IF(C141=2,0,Startup!$C$3)+IF(D141=4,0,Startup!$C$4)+IF(E141=6,0,Startup!$C$5)+IF(F141=8,0,Startup!$C$6)+IF(G141=10,0,Startup!$C$7)+IF(H141=12,0,Startup!$C$8)+IF(I141=14,0,Startup!$C$9)","v":11},"No"]
[14,1,3,4,7,8,10,12,14,{"$f":"IF(B142=0,0,Startup!$C$2)+IF(C142=2,0,Startup!$C$3)+IF(D142=4,0,Startup!$C$4)+IF(E142=6,0,Startup!$C$5)+IF(F142=8,0,Startup!$C$6)+IF(G142=10,0,Startup!$C$7)+IF(H142=12,0,Startup!$C$8)+IF(I142=14,0,Startup!$C$9)","v":11},"No"]
[14.1,1,3,4,7,8,10,12,14,{"$f":"IF(B143=0,0,Startup!$C$2)+IF(C143=2,0,Startup!$C$3)+IF(D143=4,0,Startup!$C$4)+IF(E143=6,0,Startup!$C$5)+IF(F143=8,0,Startup!$C$6)+IF(G143=10,0,Startup!$C$7)+IF(H143=12,0,Startup!$C$8)+IF(I143=14,0,Startup!$C$9)","v":11},"No"]
[14.2,1,3,4,7,8,10,12,14,{"$f":"IF(B144=0,0,Startup!$C$2)+IF(C144=2,0,Startup!$C$3)+IF(D144=4,0,Startup!$C$4)+IF(E144=6,0,Startup!$C$5)+IF(F144=8,0,Startup!$C$6)+IF(G144=10,0,Startup!$C$7)+IF(H144=12,0,Startup!$C$8)+IF(I144=14,0,Startup!$C$9)","v":11},"No"]
[14.3,1,3,4,7,8,10,12,14,{"$f":"IF(B145=0,0,Startup!$C$2)+IF(C145=2,0,Startup!$C$3)+IF(D145=4,0,Startup!$C$4)+IF(E145=6,0,Startup!$C$5)+IF(F145=8,0,Startup!$C$6)+IF(G145=10,0,Startup!$C$7)+IF(H145=12,0,Startup!$C$8)+IF(I145=14,0,Startup!$C$9)","v":11},"No"]
[14.4,1,3,4,7,8,10,12,14,{"$f":"IF(B146=0,0,Startup!$C$2)+IF(C146=2,0,Startup!$C$3)+IF(D146=4,0,Startup!$C$4)+IF(E146=6,0,Startup!$C$5)+IF(F146=8,0,Startup!$C$6)+IF(G146=10,0,Startup!$C$7)+IF(H146=12,0,Startup!$C$8)+IF(I146=14,0,Startup!$C$9)","v":11},"No"]
[14.5,1,3,4,7,8,10,12,14,{"$f":"IF(B147=0,0,Startup!$C$2)+IF(C147=2,0,Startup!$C$3)+IF(D147=4,0,Startup!$C$4)+IF(E147=6,0,Startup!$C$5)+IF(F147=8,0,Startup!$C$6)+IF(G147=10,0,Startup!$C$7)+IF(H147=12,0,Startup!$C$8)+IF(I147=14,0,Startup!$C$9)","v":11},"No"]
[14.6,1,3,4,7,8,10,12,14,{"$f":"IF(B148=0,0,Startup!$C$2)+IF(C148=2,0,Startup!$C$3)+IF(D148=4,0,Startup!$C$4)+IF(E148=6,0,Startup!$C$5)+IF(F148=8,0,Startup!$C$6)+IF(G148=10,0,Startup!$C$7)+IF(H148=12,0,Startup!$C$8)+IF(I148=14,0,Startup!$C$9)","v":11},"No"]
[14.7,1,3,4,7,8,10,12,14,{"$f":"IF(B149=0,0,Startup!$C$2)+IF(C149=2,0,Startup!$C$3)+IF(D149=4,0,Startup!$C$4)+IF(E149=6,0,Startup!$C$5)+IF(F149=8,0,Startup!$C$6)+IF(G149=10,0,Startup!$C$7)+IF(H149=12,0,Startup!$C$8)+IF(I149=14,0,Startup!$C$9)","v":11},"No"]
[14.8,1,3,4,7,8,10,12,14,{"$f":"IF(B150=0,0,Startup!$C$2)+IF(C150=2,0,Startup!$C$3)+IF(D150=4,0,Startup!$C$4)+IF(E150=6,0,Startup!$C$5)+IF(F150=8,0,Startup!$C$6)+IF(G150=10,0,Startup!$C$7)+IF(H150=12,0,Startup!$C$8)+IF(I150=14,0,Startup!$C$9)","v":11},"No"]
[14.9,1,3,4,7,8,10,12,14,{"$f":"IF(B151=0,0,Startup!$C$2)+IF(C151=2,0,Startup!$C$3)+IF(D151=4,0,Startup!$C$4)+IF(E151=6,0,Startup!$C$5)+IF(F151=8,0,Startup!$C$6)+IF(G151=10,0,Startup!$C$7)+IF(H151=12,0,Startup!$C$8)+IF(I151=14,0,Startup!$C$9)","v":11},"No"]
[15,1,3,4,7,8,10,12,14,{"$f":"IF(B152=0,0,Startup!$C$2)+IF(C152=2,0,Startup!$C$3)+IF(D152=4,0,Startup!$C$4)+IF(E152=6,0,Startup!$C$5)+IF(F152=8,0,Startup!$C$6)+IF(G152=10,0,Startup!$C$7)+IF(H152=12,0,Startup!$C$8)+IF(I152=14,0,Startup!$C$9)","v":11},"No"]
[15.1,1,3,4,7,8,10,12,14,{"$f":"IF(B153=0,0,Startup!$C$2)+IF(C153=2,0,Startup!$C$3)+IF(D153=4,0,Startup!$C$4)+IF(E153=6,0,Startup!$C$5)+IF(F153=8,0,Startup!$C$6)+IF(G153=10,0,Startup!$C$7)+IF(H153=12,0,Startup!$C$8)+IF(I153=14,0,Startup!$C$9)","v":11},"No"]
[15.2,1,3,4,7,8,10,12,14,{"$f":"IF(B154=0,0,Startup!$C$2)+IF(C154=2,0,Startup!$C$3)+IF(D154=4,0,Startup!$C$4)+IF(E154=6,0,Startup!$C$5)+IF(F154=8,0,Startup!$C$6)+IF(G154=10,0,Startup!$C$7)+IF(H154=12,0,Startup!$C$8)+IF(I154=14,0,Startup!$C$9)","v":11},"No"]
[15.3,1,3,4,7,8,10,12,14,{"$f":"IF(B155=0,0,Startup!$C$2)+IF(C155=2,0,Startup!$C$3)+IF(D155=4,0,Startup!$C$4)+IF(E155=6,0,Startup!$C$5)+IF(F155=8,0,Startup!$C$6)+IF(G155=10,0,Startup!$C$7)+IF(H155=12,0,Startup!$C$8)+IF(I155=14,0,Startup!$C$9)","v":11},"No"]
[15.4,1,3,4,7,8,10,12,14,{"$f":"IF(B156=0,0,Startup!$C$2)+IF(C156=2,0,Startup!$C$3)+IF(D156=4,0,Startup!$C$4)+IF(E156=6,0,Startup!$C$5)+IF(F156=8,0,Startup!$C$6)+IF(G156=10,0,Startup!$C$7)+IF(H156=12,0,Startup!$C$8)+IF(I156=14,0,Startup!$C$9)","v":11},"No"]
[15.5,1,3,4,7,8,10,12,14,{"$f":"IF(B157=0,0,Startup!$C$2)+IF(C157=2,0,Startup!$C$3)+IF(D157=4,0,Startup!$C$4)+IF(E157=6,0,Startup!$C$5)+IF(F157=8,0,Startup!$C$6)+IF(G157=10,0,Startup!$C$7)+IF(H157=12,0,Startup!$C$8)+IF(I157=14,0,Startup!$C$9)","v":11},"No"]
[15.6,1,3,4,7,8,10,12,14,{"$f":"IF(B158=0,0,Startup!$C$2)+IF(C158=2,0,Startup!$C$3)+IF(D158=4,0,Startup!$C$4)+IF(E158=6,0,Startup!$C$5)+IF(F158=8,0,Startup!$C$6)+IF(G158=10,0,Startup!$C$7)+IF(H158=12,0,Startup!$C$8)+IF(I158=14,0,Startup!$C$9)","v":11},"No"]
[15.7,1,3,4,7,8,10,12,14,{"$f":"IF(B159=0,0,Startup!$C$2)+IF(C159=2,0,Startup!$C$3)+IF(D159=4,0,Startup!$C$4)+IF(E159=6,0,Startup!$C$5)+IF(F159=8,0,Startup!$C$6)+IF(G159=10,0,Startup!$C$7)+IF(H159=12,0,Startup!$C$8)+IF(I159=14,0,Startup!$C$9)","v":11},"No"]
[15.8,1,3,4,7,8,10,12,14,{"$f":"IF(B160=0,0,Startup!$C$2)+IF(C160=2,0,Startup!$C$3)+IF(D160=4,0,Startup!$C$4)+IF(E160=6,0,Startup!$C$5)+IF(F160=8,0,Startup!$C$6)+IF(G160=10,0,Startup!$C$7)+IF(H160=12,0,Startup!$C$8)+IF(I160=14,0,Startup!$C$9)","v":11},"No"]
[15.9,1,3,4,7,8,10,12,14,{"$f":"IF(B161=0,0,Startup!$C$2)+IF(C161=2,0,Startup!$C$3)+IF(D161=4,0,Startup!$C$4)+IF(E161=6,0,Startup!$C$5)+IF(F161=8,0,Startup!$C$6)+IF(G161=10,0,Startup!$C$7)+IF(H161=12,0,Startup!$C$8)+IF(I161=14,0,Startup!$C$9)","v":11},"No"]
[16,1,3,4,7,8,10,12,14,{"$f":"IF(B162=0,0,Startup!$C$2)+IF(C162=2,0,Startup!$C$3)+IF(D162=4,0,Startup!$C$4)+IF(E162=6,0,Startup!$C$5)+IF(F162=8,0,Startup!$C$6)+IF(G162=10,0,Startup!$C$7)+IF(H162=12,0,Startup!$C$8)+IF(I162=14,0,Startup!$C$9)","v":11},"No"]
[16.100000000000001,1,3,4,7,8,10,12,14,{"$f":"IF(B163=0,0,Startup!$C$2)+IF(C163=2,0,Startup!$C$3)+IF(D163=4,0,Startup!$C$4)+IF(E163=6,0,Startup!$C$5)+IF(F163=8,0,Startup!$C$6)+IF(G163=10,0,Startup!$C$7)+IF(H163=12,0,Startup!$C$8)+IF(I163=14,0,Startup!$C$9)","v":11},"No"]
[16.2,1,3,4,7,8,10,12,14,{"$f":"IF(B164=0,0,Startup!$C$2)+IF(C164=2,0,Startup!$C$3)+IF(D164=4,0,Startup!$C$4)+IF(E164=6,0,Startup!$C$5)+IF(F164=8,0,Startup!$C$6)+IF(G164=10,0,Startup!$C$7)+IF(H164=12,0,Startup!$C$8)+IF(I164=14,0,Startup!$C$9)","v":11},"No"]
[16.3,1,3,4,7,8,10,12,14,{"$f":"IF(B165=0,0,Startup!$C$2)+IF(C165=2,0,Startup!$C$3)+IF(D165=4,0,Startup!$C$4)+IF(E165=6,0,Startup!$C$5)+IF(F165=8,0,Startup!$C$6)+IF(G165=10,0,Startup!$C$7)+IF(H165=12,0,Startup!$C$8)+IF(I165=14,0,Startup!$C$9)","v":11},"No"]
[16.399999999999999,1,3,4,7,8,10,12,14,{"$f":"IF(B166=0,0,Startup!$C$2)+IF(C166=2,0,Startup!$C$3)+IF(D166=4,0,Startup!$C$4)+IF(E166=6,0,Startup!$C$5)+IF(F166=8,0,Startup!$C$6)+IF(G166=10,0,Startup!$C$7)+IF(H166=12,0,Startup!$C$8)+IF(I166=14,0,Startup!$C$9)","v":11},"No"]
[16.5,1,3,4,7,8,10,12,14,{"$f":"IF(B167=0,0,Startup!$C$2)+IF(C167=2,0,Startup!$C$3)+IF(D167=4,0,Startup!$C$4)+IF(E167=6,0,Startup!$C$5)+IF(F167=8,0,Startup!$C$6)+IF(G167=10,0,Startup!$C$7)+IF(H167=12,0,Startup!$C$8)+IF(I167=14,0,Startup!$C$9)","v":11},"No"]
[16.600000000000001,1,3,4,7,8,10,12,14,{"$f":"IF(B168=0,0,Startup!$C$2)+IF(C168=2,0,Startup!$C$3)+IF(D168=4,0,Startup!$C$4)+IF(E168=6,0,Startup!$C$5)+IF(F168=8,0,Startup!$C$6)+IF(G168=10,0,Startup!$C$7)+IF(H168=12,0,Startup!$C$8)+IF(I168=14,0,Startup!$C$9)","v":11},"No"]
[16.7,1,3,4,7,8,10,12,14,{"$f":"IF(B169=0,0,Startup!$C$2)+IF(C169=2,0,Startup!$C$3)+IF(D169=4,0,Startup!$C$4)+IF(E169=6,0,Startup!$C$5)+IF(F169=8,0,Startup!$C$6)+IF(G169=10,0,Startup!$C$7)+IF(H169=12,0,Startup!$C$8)+IF(I169=14,0,Startup!$C$9)","v":11},"No"]
[16.8,1,3,4,7,8,10,12,14,{"$f":"IF(B170=0,0,Startup!$C$2)+IF(C170=2,0,Startup!$C$3)+IF(D170=4,0,Startup!$C$4)+IF(E170=6,0,Startup!$C$5)+IF(F170=8,0,Startup!$C$6)+IF(G170=10,0,Startup!$C$7)+IF(H170=12,0,Startup!$C$8)+IF(I170=14,0,Startup!$C$9)","v":11},"No"]
[16.899999999999999,1,3,4,7,8,10,12,14,{"$f":"IF(B171=0,0,Startup!$C$2)+IF(C171=2,0,Startup!$C$3)+IF(D171=4,0,Startup!$C$4)+IF(E171=6,0,Startup!$C$5)+IF(F171=8,0,Startup!$C$6)+IF(G171=10,0,Startup!$C$7)+IF(H171=12,0,Startup!$C$8)+IF(I171=14,0,Startup!$C$9)","v":11},"No"]
[17,1,3,4,7,8,10,12,14,{"$f":"IF(B172=0,0,Startup!$C$2)+IF(C172=2,0,Startup!$C$3)+IF(D172=4,0,Startup!$C$4)+IF(E172=6,0,Startup!$C$5)+IF(F172=8,0,Startup!$C$6)+IF(G172=10,0,Startup!$C$7)+IF(H172=12,0,Startup!$C$8)+IF(I172=14,0,Startup!$C$9)","v":11},"No"]
[17.100000000000001,1,3,4,7,8,10,12,14,{"$f":"IF(B173=0,0,Startup!$C$2)+IF(C173=2,0,Startup!$C$3)+IF(D173=4,0,Startup!$C$4)+IF(E173=6,0,Startup!$C$5)+IF(F173=8,0,Startup!$C$6)+IF(G173=10,0,Startup!$C$7)+IF(H173=12,0,Startup!$C$8)+IF(I173=14,0,Startup!$C$9)","v":11},"No"]
[17.2,1,3,4,7,8,10,12,14,{"$f":"IF(B174=0,0,Startup!$C$2)+IF(C174=2,0,Startup!$C$3)+IF(D174=4,0,Startup!$C$4)+IF(E174=6,0,Startup!$C$5)+IF(F174=8,0,Startup!$C$6)+IF(G174=10,0,Startup!$C$7)+IF(H174=12,0,Startup!$C$8)+IF(I174=14,0,Startup!$C$9)","v":11},"No"]
[17.3,1,3,4,7,8,10,12,14,{"$f":"IF(B175=0,0,Startup!$C$2)+IF(C175=2,0,Startup!$C$3)+IF(D175=4,0,Startup!$C$4)+IF(E175=6,0,Startup!$C$5)+IF(F175=8,0,Startup!$C$6)+IF(G175=10,0,Startup!$C$7)+IF(H175=12,0,Startup!$C$8)+IF(I175=14,0,Startup!$C$9)","v":11},"No"]
[17.399999999999999,1,3,4,7,8,10,12,14,{"$f":"IF(B176=0,0,Startup!$C$2)+IF(C176=2,0,Startup!$C$3)+IF(D176=4,0,Startup!$C$4)+IF(E176=6,0,Startup!$C$5)+IF(F176=8,0,Startup!$C$6)+IF(G176=10,0,Startup!$C$7)+IF(H176=12,0,Startup!$C$8)+IF(I176=14,0,Startup!$C$9)","v":11},"No"]
[17.5,1,3,4,7,8,10,12,14,{"$f":"IF(B177=0,0,Startup!$C$2)+IF(C177=2,0,Startup!$C$3)+IF(D177=4,0,Startup!$C$4)+IF(E177=6,0,Startup!$C$5)+IF(F177=8,0,Startup!$C$6)+IF(G177=10,0,Startup!$C$7)+IF(H177=12,0,Startup!$C$8)+IF(I177=14,0,Startup!$C$9)","v":11},"No"]
[17.600000000000001,1,3,4,7,8,10,12,14,{"$f":"IF(B178=0,0,Startup!$C$2)+IF(C178=2,0,Startup!$C$3)+IF(D178=4,0,Startup!$C$4)+IF(E178=6,0,Startup!$C$5)+IF(F178=8,0,Startup!$C$6)+IF(G178=10,0,Startup!$C$7)+IF(H178=12,0,Startup!$C$8)+IF(I178=14,0,Startup!$C$9)","v":11},"No"]
[17.7,1,3,4,7,8,10,12,14,{"$f":"IF(B179=0,0,Startup!$C$2)+IF(C179=2,0,Startup!$C$3)+IF(D179=4,0,Startup!$C$4)+IF(E179=6,0,Startup!$C$5)+IF(F179=8,0,Startup!$C$6)+IF(G179=10,0,Startup!$C$7)+IF(H179=12,0,Startup!$C$8)+IF(I179=14,0,Startup!$C$9)","v":11},"No"]
[17.8,1,3,4,7,8,10,12,14,{"$f":"IF(B180=0,0,Startup!$C$2)+IF(C180=2,0,Startup!$C$3)+IF(D180=4,0,Startup!$C$4)+IF(E180=6,0,Startup!$C$5)+IF(F180=8,0,Startup!$C$6)+IF(G180=10,0,Startup!$C$7)+IF(H180=12,0,Startup!$C$8)+IF(I180=14,0,Startup!$C$9)","v":11},"No"]
[17.899999999999999,1,3,4,7,8,10,12,14,{"$f":"IF(B181=0,0,Startup!$C$2)+IF(C181=2,0,Startup!$C$3)+IF(D181=4,0,Startup!$C$4)+IF(E181=6,0,Startup!$C$5)+IF(F181=8,0,Startup!$C$6)+IF(G181=10,0,Startup!$C$7)+IF(H181=12,0,Startup!$C$8)+IF(I181=14,0,Startup!$C$9)","v":11},"No"]
[18,1,3,4,7,8,10,12,14,{"$f":"IF(B182=0,0,Startup!$C$2)+IF(C182=2,0,Startup!$C$3)+IF(D182=4,0,Startup!$C$4)+IF(E182=6,0,Startup!$C$5)+IF(F182=8,0,Startup!$C$6)+IF(G182=10,0,Startup!$C$7)+IF(H182=12,0,Startup!$C$8)+IF(I182=14,0,Startup!$C$9)","v":11},"No"]
[18.100000000000001,1,3,4,7,8,10,12,14,{"$f":"IF(B183=0,0,Startup!$C$2)+IF(C183=2,0,Startup!$C$3)+IF(D183=4,0,Startup!$C$4)+IF(E183=6,0,Startup!$C$5)+IF(F183=8,0,Startup!$C$6)+IF(G183=10,0,Startup!$C$7)+IF(H183=12,0,Startup!$C$8)+IF(I183=14,0,Startup!$C$9)","v":11},"No"]
[18.2,1,3,4,7,8,10,12,14,{"$f":"IF(B184=0,0,Startup!$C$2)+IF(C184=2,0,Startup!$C$3)+IF(D184=4,0,Startup!$C$4)+IF(E184=6,0,Startup!$C$5)+IF(F184=8,0,Startup!$C$6)+IF(G184=10,0,Startup!$C$7)+IF(H184=12,0,Startup!$C$8)+IF(I184=14,0,Startup!$C$9)","v":11},"No"]
[18.3,1,3,4,7,8,10,12,14,{"$f":"IF(B185=0,0,Startup!$C$2)+IF(C185=2,0,Startup!$C$3)+IF(D185=4,0,Startup!$C$4)+IF(E185=6,0,Startup!$C$5)+IF(F185=8,0,Startup!$C$6)+IF(G185=10,0,Startup!$C$7)+IF(H185=12,0,Startup!$C$8)+IF(I185=14,0,Startup!$C$9)","v":11},"No"]
[18.399999999999999,1,3,4,7,8,10,12,14,{"$f":"IF(B186=0,0,Startup!$C$2)+IF(C186=2,0,Startup!$C$3)+IF(D186=4,0,Startup!$C$4)+IF(E186=6,0,Startup!$C$5)+IF(F186=8,0,Startup!$C$6)+IF(G186=10,0,Startup!$C$7)+IF(H186=12,0,Startup!$C$8)+IF(I186=14,0,Startup!$C$9)","v":11},"No"]
[18.5,1,3,4,7,8,10,12,14,{"$f":"IF(B187=0,0,Startup!$C$2)+IF(C187=2,0,Startup!$C$3)+IF(D187=4,0,Startup!$C$4)+IF(E187=6,0,Startup!$C$5)+IF(F187=8,0,Startup!$C$6)+IF(G187=10,0,Startup!$C$7)+IF(H187=12,0,Startup!$C$8)+IF(I187=14,0,Startup!$C$9)","v":11},"No"]
[18.600000000000001,1,3,4,7,8,10,12,14,{"$f":"IF(B188=0,0,Startup!$C$2)+IF(C188=2,0,Startup!$C$3)+IF(D188=4,0,Startup!$C$4)+IF(E188=6,0,Startup!$C$5)+IF(F188=8,0,Startup!$C$6)+IF(G188=10,0,Startup!$C$7)+IF(H188=12,0,Startup!$C$8)+IF(I188=14,0,Startup!$C$9)","v":11},"No"]
[18.7,1,3,4,7,8,10,12,14,{"$f":"IF(B189=0,0,Startup!$C$2)+IF(C189=2,0,Startup!$C$3)+IF(D189=4,0,Startup!$C$4)+IF(E189=6,0,Startup!$C$5)+IF(F189=8,0,Startup!$C$6)+IF(G189=10,0,Startup!$C$7)+IF(H189=12,0,Startup!$C$8)+IF(I189=14,0,Startup!$C$9)","v":11},"No"]
[18.8,1,3,4,7,8,10,12,14,{"$f":"IF(B190=0,0,Startup!$C$2)+IF(C190=2,0,Startup!$C$3)+IF(D190=4,0,Startup!$C$4)+IF(E190=6,0,Startup!$C$5)+IF(F190=8,0,Startup!$C$6)+IF(G190=10,0,Startup!$C$7)+IF(H190=12,0,Startup!$C$8)+IF(I190=14,0,Startup!$C$9)","v":11},"No"]
[18.899999999999999,1,3,4,7,8,10,12,14,{"$f":"IF(B191=0,0,Startup!$C$2)+IF(C191=2,0,Startup!$C$3)+IF(D191=4,0,Startup!$C$4)+IF(E191=6,0,Startup!$C$5)+IF(F191=8,0,Startup!$C$6)+IF(G191=10,0,Startup!$C$7)+IF(H191=12,0,Startup!$C$8)+IF(I191=14,0,Startup!$C$9)","v":11},"No"]
[19,1,3,4,7,8,10,12,14,{"$f":"IF(B192=0,0,Startup!$C$2)+IF(C192=2,0,Startup!$C$3)+IF(D192=4,0,Startup!$C$4)+IF(E192=6,0,Startup!$C$5)+IF(F192=8,0,Startup!$C$6)+IF(G192=10,0,Startup!$C$7)+IF(H192=12,0,Startup!$C$8)+IF(I192=14,0,Startup!$C$9)","v":11},"No"]
[19.100000000000001,1,3,4,7,8,10,12,14,{"$f":"IF(B193=0,0,Startup!$C$2)+IF(C193=2,0,Startup!$C$3)+IF(D193=4,0,Startup!$C$4)+IF(E193=6,0,Startup!$C$5)+IF(F193=8,0,Startup!$C$6)+IF(G193=10,0,Startup!$C$7)+IF(H193=12,0,Startup!$C$8)+IF(I193=14,0,Startup!$C$9)","v":11},"No"]
[19.2,1,3,4,7,8,10,12,14,{"$f":"IF(B194=0,0,Startup!$C$2)+IF(C194=2,0,Startup!$C$3)+IF(D194=4,0,Startup!$C$4)+IF(E194=6,0,Startup!$C$5)+IF(F194=8,0,Startup!$C$6)+IF(G194=10,0,Startup!$C$7)+IF(H194=12,0,Startup!$C$8)+IF(I194=14,0,Startup!$C$9)","v":11},"No"]
[19.3,1,3,4,7,8,10,12,14,{"$f":"IF(B195=0,0,Startup!$C$2)+IF(C195=2,0,Startup!$C$3)+IF(D195=4,0,Startup!$C$4)+IF(E195=6,0,Startup!$C$5)+IF(F195=8,0,Startup!$C$6)+IF(G195=10,0,Startup!$C$7)+IF(H195=12,0,Startup!$C$8)+IF(I195=14,0,Startup!$C$9)","v":11},"No"]
[19.399999999999999,1,3,4,7,8,10,12,14,{"$f":"IF(B196=0,0,Startup!$C$2)+IF(C196=2,0,Startup!$C$3)+IF(D196=4,0,Startup!$C$4)+IF(E196=6,0,Startup!$C$5)+IF(F196=8,0,Startup!$C$6)+IF(G196=10,0,Startup!$C$7)+IF(H196=12,0,Startup!$C$8)+IF(I196=14,0,Startup!$C$9)","v":11},{"$f":"IF(J196<>J195,\"Yes\",\"No\")","v":"No"}]
[19.5,1,3,4,7,8,10,12,14,{"$f":"IF(B197=0,0,Startup!$C$2)+IF(C197=2,0,Startup!$C$3)+IF(D197=4,0,Startup!$C$4)+IF(E197=6,0,Startup!$C$5)+IF(F197=8,0,Startup!$C$6)+IF(G197=10,0,Startup!$C$7)+IF(H197=12,0,Startup!$C$8)+IF(I197=14,0,Startup!$C$9)","v":11},"No"]
[19.600000000000001,1,3,4,7,8,10,12,14,{"$f":"IF(B198=0,0,Startup!$C$2)+IF(C198=2,0,Startup!$C$3)+IF(D198=4,0,Startup!$C$4)+IF(E198=6,0,Startup!$C$5)+IF(F198=8,0,Startup!$C$6)+IF(G198=10,0,Startup!$C$7)+IF(H198=12,0,Startup!$C$8)+IF(I198=14,0,Startup!$C$9)","v":11},"No"]
[19.7,1,3,4,7,8,10,12,14,{"$f":"IF(B199=0,0,Startup!$C$2)+IF(C199=2,0,Startup!$C$3)+IF(D199=4,0,Startup!$C$4)+IF(E199=6,0,Startup!$C$5)+IF(F199=8,0,Startup!$C$6)+IF(G199=10,0,Startup!$C$7)+IF(H199=12,0,Startup!$C$8)+IF(I199=14,0,Startup!$C$9)","v":11},"No"]
[19.8,1,3,4,7,8,10,12,14,{"$f":"IF(B200=0,0,Startup!$C$2)+IF(C200=2,0,Startup!$C$3)+IF(D200=4,0,Startup!$C$4)+IF(E200=6,0,Startup!$C$5)+IF(F200=8,0,Startup!$C$6)+IF(G200=10,0,Startup!$C$7)+IF(H200=12,0,Startup!$C$8)+IF(I200=14,0,Startup!$C$9)","v":11},"No"]
[19.899999999999999,1,3,4,7,8,10,12,14,{"$f":"IF(B201=0,0,Startup!$C$2)+IF(C201=2,0,Startup!$C$3)+IF(D201=4,0,Startup!$C$4)+IF(E201=6,0,Startup!$C$5)+IF(F201=8,0,Startup!$C$6)+IF(G201=10,0,Startup!$C$7)+IF(H201=12,0,Startup!$C$8)+IF(I201=14,0,Startup!$C$9)","v":11},"No"]
[20,1,2,4,7,8,10,12,14,{"$f":"IF(B202=0,0,Startup!$C$2)+IF(C202=2,0,Startup!$C$3)+IF(D202=4,0,Startup!$C$4)+IF(E202=6,0,Startup!$C$5)+IF(F202=8,0,Startup!$C$6)+IF(G202=10,0,Startup!$C$7)+IF(H202=12,0,Startup!$C$8)+IF(I202=14,0,Startup!$C$9)","v":9},"Yes"]
[20.100000000000001,1,2,4,7,8,10,12,14,{"$f":"IF(B203=0,0,Startup!$C$2)+IF(C203=2,0,Startup!$C$3)+IF(D203=4,0,Startup!$C$4)+IF(E203=6,0,Startup!$C$5)+IF(F203=8,0,Startup!$C$6)+IF(G203=10,0,Startup!$C$7)+IF(H203=12,0,Startup!$C$8)+IF(I203=14,0,Startup!$C$9)","v":9},"No"]
[20.2,1,2,4,7,8,10,12,14,{"$f":"IF(B204=0,0,Startup!$C$2)+IF(C204=2,0,Startup!$C$3)+IF(D204=4,0,Startup!$C$4)+IF(E204=6,0,Startup!$C$5)+IF(F204=8,0,Startup!$C$6)+IF(G204=10,0,Startup!$C$7)+IF(H204=12,0,Startup!$C$8)+IF(I204=14,0,Startup!$C$9)","v":9},"No"]
[20.3,1,2,4,7,8,10,12,14,{"$f":"IF(B205=0,0,Startup!$C$2)+IF(C205=2,0,Startup!$C$3)+IF(D205=4,0,Startup!$C$4)+IF(E205=6,0,Startup!$C$5)+IF(F205=8,0,Startup!$C$6)+IF(G205=10,0,Startup!$C$7)+IF(H205=12,0,Startup!$C$8)+IF(I205=14,0,Startup!$C$9)","v":9},"No"]
[20.399999999999999,1,2,4,7,8,10,12,14,{"$f":"IF(B206=0,0,Startup!$C$2)+IF(C206=2,0,Startup!$C$3)+IF(D206=4,0,Startup!$C$4)+IF(E206=6,0,Startup!$C$5)+IF(F206=8,0,Startup!$C$6)+IF(G206=10,0,Startup!$C$7)+IF(H206=12,0,Startup!$C$8)+IF(I206=14,0,Startup!$C$9)","v":9},"No"]
[20.5,1,2,4,7,8,10,12,14,{"$f":"IF(B207=0,0,Startup!$C$2)+IF(C207=2,0,Startup!$C$3)+IF(D207=4,0,Startup!$C$4)+IF(E207=6,0,Startup!$C$5)+IF(F207=8,0,Startup!$C$6)+IF(G207=10,0,Startup!$C$7)+IF(H207=12,0,Startup!$C$8)+IF(I207=14,0,Startup!$C$9)","v":9},"No"]
[20.6,1,2,4,7,8,10,12,14,{"$f":"IF(B208=0,0,Startup!$C$2)+IF(C208=2,0,Startup!$C$3)+IF(D208=4,0,Startup!$C$4)+IF(E208=6,0,Startup!$C$5)+IF(F208=8,0,Startup!$C$6)+IF(G208=10,0,Startup!$C$7)+IF(H208=12,0,Startup!$C$8)+IF(I208=14,0,Startup!$C$9)","v":9},"No"]
[20.7,1,2,4,7,8,10,12,14,{"$f":"IF(B209=0,0,Startup!$C$2)+IF(C209=2,0,Startup!$C$3)+IF(D209=4,0,Startup!$C$4)+IF(E209=6,0,Startup!$C$5)+IF(F209=8,0,Startup!$C$6)+IF(G209=10,0,Startup!$C$7)+IF(H209=12,0,Startup!$C$8)+IF(I209=14,0,Startup!$C$9)","v":9},"No"]
[20.8,1,2,4,7,8,10,12,14,{"$f":"IF(B210=0,0,Startup!$C$2)+IF(C210=2,0,Startup!$C$3)+IF(D210=4,0,Startup!$C$4)+IF(E210=6,0,Startup!$C$5)+IF(F210=8,0,Startup!$C$6)+IF(G210=10,0,Startup!$C$7)+IF(H210=12,0,Startup!$C$8)+IF(I210=14,0,Startup!$C$9)","v":9},"No"]
[20.9,1,2,4,7,8,10,12,14,{"$f":"IF(B211=0,0,Startup!$C$2)+IF(C211=2,0,Startup!$C$3)+IF(D211=4,0,Startup!$C$4)+IF(E211=6,0,Startup!$C$5)+IF(F211=8,0,Startup!$C$6)+IF(G211=10,0,Startup!$C$7)+IF(H211=12,0,Startup!$C$8)+IF(I211=14,0,Startup!$C$9)","v":9},"No"]
[21,1,2,4,7,8,10,12,15,{"$f":"IF(B212=0,0,Startup!$C$2)+IF(C212=2,0,Startup!$C$3)+IF(D212=4,0,Startup!$C$4)+IF(E212=6,0,Startup!$C$5)+IF(F212=8,0,Startup!$C$6)+IF(G212=10,0,Startup!$C$7)+IF(H212=12,0,Startup!$C$8)+IF(I212=14,0,Startup!$C$9)","v":137},"Yes"]
[21.1,1,2,4,7,8,10,12,15,{"$f":"IF(B213=0,0,Startup!$C$2)+IF(C213=2,0,Startup!$C$3)+IF(D213=4,0,Startup!$C$4)+IF(E213=6,0,Startup!$C$5)+IF(F213=8,0,Startup!$C$6)+IF(G213=10,0,Startup!$C$7)+IF(H213=12,0,Startup!$C$8)+IF(I213=14,0,Startup!$C$9)","v":137},"No"]
[21.2,1,2,4,7,8,10,12,15,{"$f":"IF(B214=0,0,Startup!$C$2)+IF(C214=2,0,Startup!$C$3)+IF(D214=4,0,Startup!$C$4)+IF(E214=6,0,Startup!$C$5)+IF(F214=8,0,Startup!$C$6)+IF(G214=10,0,Startup!$C$7)+IF(H214=12,0,Startup!$C$8)+IF(I214=14,0,Startup!$C$9)","v":137},"No"]
[21.3,1,2,4,7,8,10,12,15,{"$f":"IF(B215=0,0,Startup!$C$2)+IF(C215=2,0,Startup!$C$3)+IF(D215=4,0,Startup!$C$4)+IF(E215=6,0,Startup!$C$5)+IF(F215=8,0,Startup!$C$6)+IF(G215=10,0,Startup!$C$7)+IF(H215=12,0,Startup!$C$8)+IF(I215=14,0,Startup!$C$9)","v":137},"No"]
[21.4,1,2,4,7,8,10,12,15,{"$f":"IF(B216=0,0,Startup!$C$2)+IF(C216=2,0,Startup!$C$3)+IF(D216=4,0,Startup!$C$4)+IF(E216=6,0,Startup!$C$5)+IF(F216=8,0,Startup!$C$6)+IF(G216=10,0,Startup!$C$7)+IF(H216=12,0,Startup!$C$8)+IF(I216=14,0,Startup!$C$9)","v":137},"No"]
[21.5,1,2,4,7,8,10,12,15,{"$f":"IF(B217=0,0,Startup!$C$2)+IF(C217=2,0,Startup!$C$3)+IF(D217=4,0,Startup!$C$4)+IF(E217=6,0,Startup!$C$5)+IF(F217=8,0,Startup!$C$6)+IF(G217=10,0,Startup!$C$7)+IF(H217=12,0,Startup!$C$8)+IF(I217=14,0,Startup!$C$9)","v":137},"No"]
[21.6,1,2,4,7,8,10,12,15,{"$f":"IF(B218=0,0,Startup!$C$2)+IF(C218=2,0,Startup!$C$3)+IF(D218=4,0,Startup!$C$4)+IF(E218=6,0,Startup!$C$5)+IF(F218=8,0,Startup!$C$6)+IF(G218=10,0,Startup!$C$7)+IF(H218=12,0,Startup!$C$8)+IF(I218=14,0,Startup!$C$9)","v":137},"No"]
[21.7,1,2,4,7,8,10,12,15,{"$f":"IF(B219=0,0,Startup!$C$2)+IF(C219=2,0,Startup!$C$3)+IF(D219=4,0,Startup!$C$4)+IF(E219=6,0,Startup!$C$5)+IF(F219=8,0,Startup!$C$6)+IF(G219=10,0,Startup!$C$7)+IF(H219=12,0,Startup!$C$8)+IF(I219=14,0,Startup!$C$9)","v":137},"No"]
[21.8,1,2,4,7,8,10,12,15,{"$f":"IF(B220=0,0,Startup!$C$2)+IF(C220=2,0,Startup!$C$3)+IF(D220=4,0,Startup!$C$4)+IF(E220=6,0,Startup!$C$5)+IF(F220=8,0,Startup!$C$6)+IF(G220=10,0,Startup!$C$7)+IF(H220=12,0,Startup!$C$8)+IF(I220=14,0,Startup!$C$9)","v":137},"No"]
[21.9,1,2,4,7,8,10,12,15,{"$f":"IF(B221=0,0,Startup!$C$2)+IF(C221=2,0,Startup!$C$3)+IF(D221=4,0,Startup!$C$4)+IF(E221=6,0,Startup!$C$5)+IF(F221=8,0,Startup!$C$6)+IF(G221=10,0,Startup!$C$7)+IF(H221=12,0,Startup!$C$8)+IF(I221=14,0,Startup!$C$9)","v":137},"No"]
[22,1,2,4,7,8,10,12,15,{"$f":"IF(B222=0,0,Startup!$C$2)+IF(C222=2,0,Startup!$C$3)+IF(D222=4,0,Startup!$C$4)+IF(E222=6,0,Startup!$C$5)+IF(F222=8,0,Startup!$C$6)+IF(G222=10,0,Startup!$C$7)+IF(H222=12,0,Startup!$C$8)+IF(I222=14,0,Startup!$C$9)","v":137},"No"]
[22.1,1,2,4,7,8,10,12,15,{"$f":"IF(B223=0,0,Startup!$C$2)+IF(C223=2,0,Startup!$C$3)+IF(D223=4,0,Startup!$C$4)+IF(E223=6,0,Startup!$C$5)+IF(F223=8,0,Startup!$C$6)+IF(G223=10,0,Startup!$C$7)+IF(H223=12,0,Startup!$C$8)+IF(I223=14,0,Startup!$C$9)","v":137},"No"]
[22.2,1,2,4,7,8,10,12,15,{"$f":"IF(B224=0,0,Startup!$C$2)+IF(C224=2,0,Startup!$C$3)+IF(D224=4,0,Startup!$C$4)+IF(E224=6,0,Startup!$C$5)+IF(F224=8,0,Startup!$C$6)+IF(G224=10,0,Startup!$C$7)+IF(H224=12,0,Startup!$C$8)+IF(I224=14,0,Startup!$C$9)","v":137},"No"]
[22.3,1,2,4,7,8,10,12,15,{"$f":"IF(B225=0,0,Startup!$C$2)+IF(C225=2,0,Startup!$C$3)+IF(D225=4,0,Startup!$C$4)+IF(E225=6,0,Startup!$C$5)+IF(F225=8,0,Startup!$C$6)+IF(G225=10,0,Startup!$C$7)+IF(H225=12,0,Startup!$C$8)+IF(I225=14,0,Startup!$C$9)","v":137},"No"]
[22.4,1,2,4,7,8,10,12,15,{"$f":"IF(B226=0,0,Startup!$C$2)+IF(C226=2,0,Startup!$C$3)+IF(D226=4,0,Startup!$C$4)+IF(E226=6,0,Startup!$C$5)+IF(F226=8,0,Startup!$C$6)+IF(G226=10,0,Startup!$C$7)+IF(H226=12,0,Startup!$C$8)+IF(I226=14,0,Startup!$C$9)","v":137},"No"]
[22.5,1,2,4,7,8,10,12,15,{"$f":"IF(B227=0,0,Startup!$C$2)+IF(C227=2,0,Startup!$C$3)+IF(D227=4,0,Startup!$C$4)+IF(E227=6,0,Startup!$C$5)+IF(F227=8,0,Startup!$C$6)+IF(G227=10,0,Startup!$C$7)+IF(H227=12,0,Startup!$C$8)+IF(I227=14,0,Startup!$C$9)","v":137},"No"]
[22.6,1,2,4,7,8,10,12,15,{"$f":"IF(B228=0,0,Startup!$C$2)+IF(C228=2,0,Startup!$C$3)+IF(D228=4,0,Startup!$C$4)+IF(E228=6,0,Startup!$C$5)+IF(F228=8,0,Startup!$C$6)+IF(G228=10,0,Startup!$C$7)+IF(H228=12,0,Startup!$C$8)+IF(I228=14,0,Startup!$C$9)","v":137},"No"]
[22.7,1,2,4,7,8,10,12,15,{"$f":"IF(B229=0,0,Startup!$C$2)+IF(C229=2,0,Startup!$C$3)+IF(D229=4,0,Startup!$C$4)+IF(E229=6,0,Startup!$C$5)+IF(F229=8,0,Startup!$C$6)+IF(G229=10,0,Startup!$C$7)+IF(H229=12,0,Startup!$C$8)+IF(I229=14,0,Startup!$C$9)","v":137},"No"]
[22.8,1,2,4,7,8,10,12,15,{"$f":"IF(B230=0,0,Startup!$C$2)+IF(C230=2,0,Startup!$C$3)+IF(D230=4,0,Startup!$C$4)+IF(E230=6,0,Startup!$C$5)+IF(F230=8,0,Startup!$C$6)+IF(G230=10,0,Startup!$C$7)+IF(H230=12,0,Startup!$C$8)+IF(I230=14,0,Startup!$C$9)","v":137},"No"]
[22.9,1,2,4,7,8,10,12,15,{"$f":"IF(B231=0,0,Startup!$C$2)+IF(C231=2,0,Startup!$C$3)+IF(D231=4,0,Startup!$C$4)+IF(E231=6,0,Startup!$C$5)+IF(F231=8,0,Startup!$C$6)+IF(G231=10,0,Startup!$C$7)+IF(H231=12,0,Startup!$C$8)+IF(I231=14,0,Startup!$C$9)","v":137},"No"]
[23,1,2,4,7,8,10,12,15,{"$f":"IF(B232=0,0,Startup!$C$2)+IF(C232=2,0,Startup!$C$3)+IF(D232=4,0,Startup!$C$4)+IF(E232=6,0,Startup!$C$5)+IF(F232=8,0,Startup!$C$6)+IF(G232=10,0,Startup!$C$7)+IF(H232=12,0,Startup!$C$8)+IF(I232=14,0,Startup!$C$9)","v":137},"No"]
[23.1,1,2,4,7,8,10,12,15,{"$f":"IF(B233=0,0,Startup!$C$2)+IF(C233=2,0,Startup!$C$3)+IF(D233=4,0,Startup!$C$4)+IF(E233=6,0,Startup!$C$5)+IF(F233=8,0,Startup!$C$6)+IF(G233=10,0,Startup!$C$7)+IF(H233=12,0,Startup!$C$8)+IF(I233=14,0,Startup!$C$9)","v":137},"No"]
[23.2,1,2,4,7,8,10,12,15,{"$f":"IF(B234=0,0,Startup!$C$2)+IF(C234=2,0,Startup!$C$3)+IF(D234=4,0,Startup!$C$4)+IF(E234=6,0,Startup!$C$5)+IF(F234=8,0,Startup!$C$6)+IF(G234=10,0,Startup!$C$7)+IF(H234=12,0,Startup!$C$8)+IF(I234=14,0,Startup!$C$9)","v":137},"No"]
[23.3,1,2,4,7,8,10,12,15,{"$f":"IF(B235=0,0,Startup!$C$2)+IF(C235=2,0,Startup!$C$3)+IF(D235=4,0,Startup!$C$4)+IF(E235=6,0,Startup!$C$5)+IF(F235=8,0,Startup!$C$6)+IF(G235=10,0,Startup!$C$7)+IF(H235=12,0,Startup!$C$8)+IF(I235=14,0,Startup!$C$9)","v":137},"No"]
[23.4,1,2,4,7,8,10,12,15,{"$f":"IF(B236=0,0,Startup!$C$2)+IF(C236=2,0,Startup!$C$3)+IF(D236=4,0,Startup!$C$4)+IF(E236=6,0,Startup!$C$5)+IF(F236=8,0,Startup!$C$6)+IF(G236=10,0,Startup!$C$7)+IF(H236=12,0,Startup!$C$8)+IF(I236=14,0,Startup!$C$9)","v":137},"No"]
[23.5,1,2,4,7,8,10,12,15,{"$f":"IF(B237=0,0,Startup!$C$2)+IF(C237=2,0,Startup!$C$3)+IF(D237=4,0,Startup!$C$4)+IF(E237=6,0,Startup!$C$5)+IF(F237=8,0,Startup!$C$6)+IF(G237=10,0,Startup!$C$7)+IF(H237=12,0,Startup!$C$8)+IF(I237=14,0,Startup!$C$9)","v":137},"No"]
[23.6,1,2,4,7,8,10,12,15,{"$f":"IF(B238=0,0,Startup!$C$2)+IF(C238=2,0,Startup!$C$3)+IF(D238=4,0,Startup!$C$4)+IF(E238=6,0,Startup!$C$5)+IF(F238=8,0,Startup!$C$6)+IF(G238=10,0,Startup!$C$7)+IF(H238=12,0,Startup!$C$8)+IF(I238=14,0,Startup!$C$9)","v":137},"No"]
[23.7,1,2,4,7,8,10,12,15,{"$f":"IF(B239=0,0,Startup!$C$2)+IF(C239=2,0,Startup!$C$3)+IF(D239=4,0,Startup!$C$4)+IF(E239=6,0,Startup!$C$5)+IF(F239=8,0,Startup!$C$6)+IF(G239=10,0,Startup!$C$7)+IF(H239=12,0,Startup!$C$8)+IF(I239=14,0,Startup!$C$9)","v":137},"No"]
[23.8,1,2,4,7,8,10,12,15,{"$f":"IF(B240=0,0,Startup!$C$2)+IF(C240=2,0,Startup!$C$3)+IF(D240=4,0,Startup!$C$4)+IF(E240=6,0,Startup!$C$5)+IF(F240=8,0,Startup!$C$6)+IF(G240=10,0,Startup!$C$7)+IF(H240=12,0,Startup!$C$8)+IF(I240=14,0,Startup!$C$9)","v":137},"No"]
[23.9,1,2,4,7,8,10,12,15,{"$f":"IF(B241=0,0,Startup!$C$2)+IF(C241=2,0,Startup!$C$3)+IF(D241=4,0,Startup!$C$4)+IF(E241=6,0,Startup!$C$5)+IF(F241=8,0,Startup!$C$6)+IF(G241=10,0,Startup!$C$7)+IF(H241=12,0,Startup!$C$8)+IF(I241=14,0,Startup!$C$9)","v":137},"No"]
[24,1,2,4,7,8,10,12,15,{"$f":"IF(B242=0,0,Startup!$C$2)+IF(C242=2,0,Startup!$C$3)+IF(D242=4,0,Startup!$C$4)+IF(E242=6,0,Startup!$C$5)+IF(F242=8,0,Startup!$C$6)+IF(G242=10,0,Startup!$C$7)+IF(H242=12,0,Startup!$C$8)+IF(I242=14,0,Startup!$C$9)","v":137},"No"]
[24.1,1,2,4,7,8,10,12,15,{"$f":"IF(B243=0,0,Startup!$C$2)+IF(C243=2,0,Startup!$C$3)+IF(D243=4,0,Startup!$C$4)+IF(E243=6,0,Startup!$C$5)+IF(F243=8,0,Startup!$C$6)+IF(G243=10,0,Startup!$C$7)+IF(H243=12,0,Startup!$C$8)+IF(I243=14,0,Startup!$C$9)","v":137},"No"]
[24.2,1,2,4,7,8,10,12,15,{"$f":"IF(B244=0,0,Startup!$C$2)+IF(C244=2,0,Startup!$C$3)+IF(D244=4,0,Startup!$C$4)+IF(E244=6,0,Startup!$C$5)+IF(F244=8,0,Startup!$C$6)+IF(G244=10,0,Startup!$C$7)+IF(H244=12,0,Startup!$C$8)+IF(I244=14,0,Startup!$C$9)","v":137},"No"]
[24.3,1,2,4,7,8,10,12,15,{"$f":"IF(B245=0,0,Startup!$C$2)+IF(C245=2,0,Startup!$C$3)+IF(D245=4,0,Startup!$C$4)+IF(E245=6,0,Startup!$C$5)+IF(F245=8,0,Startup!$C$6)+IF(G245=10,0,Startup!$C$7)+IF(H245=12,0,Startup!$C$8)+IF(I245=14,0,Startup!$C$9)","v":137},"No"]
[24.4,1,2,4,7,8,10,12,15,{"$f":"IF(B246=0,0,Startup!$C$2)+IF(C246=2,0,Startup!$C$3)+IF(D246=4,0,Startup!$C$4)+IF(E246=6,0,Startup!$C$5)+IF(F246=8,0,Startup!$C$6)+IF(G246=10,0,Startup!$C$7)+IF(H246=12,0,Startup!$C$8)+IF(I246=14,0,Startup!$C$9)","v":137},"No"]
[24.5,1,2,4,7,8,10,12,15,{"$f":"IF(B247=0,0,Startup!$C$2)+IF(C247=2,0,Startup!$C$3)+IF(D247=4,0,Startup!$C$4)+IF(E247=6,0,Startup!$C$5)+IF(F247=8,0,Startup!$C$6)+IF(G247=10,0,Startup!$C$7)+IF(H247=12,0,Startup!$C$8)+IF(I247=14,0,Startup!$C$9)","v":137},"No"]
[24.6,1,2,4,7,8,10,12,15,{"$f":"IF(B248=0,0,Startup!$C$2)+IF(C248=2,0,Startup!$C$3)+IF(D248=4,0,Startup!$C$4)+IF(E248=6,0,Startup!$C$5)+IF(F248=8,0,Startup!$C$6)+IF(G248=10,0,Startup!$C$7)+IF(H248=12,0,Startup!$C$8)+IF(I248=14,0,Startup!$C$9)","v":137},"No"]
[24.7,1,2,4,7,8,10,12,15,{"$f":"IF(B249=0,0,Startup!$C$2)+IF(C249=2,0,Startup!$C$3)+IF(D249=4,0,Startup!$C$4)+IF(E249=6,0,Startup!$C$5)+IF(F249=8,0,Startup!$C$6)+IF(G249=10,0,Startup!$C$7)+IF(H249=12,0,Startup!$C$8)+IF(I249=14,0,Startup!$C$9)","v":137},"No"]
[24.8,1,2,4,7,8,10,12,15,{"$f":"IF(B250=0,0,Startup!$C$2)+IF(C250=2,0,Startup!$C$3)+IF(D250=4,0,Startup!$C$4)+IF(E250=6,0,Startup!$C$5)+IF(F250=8,0,Startup!$C$6)+IF(G250=10,0,Startup!$C$7)+IF(H250=12,0,Startup!$C$8)+IF(I250=14,0,Startup!$C$9)","v":137},"No"]
[24.9,1,2,4,7,8,10,12,15,{"$f":"IF(B251=0,0,Startup!$C$2)+IF(C251=2,0,Startup!$C$3)+IF(D251=4,0,Startup!$C$4)+IF(E251=6,0,Startup!$C$5)+IF(F251=8,0,Startup!$C$6)+IF(G251=10,0,Startup!$C$7)+IF(H251=12,0,Startup!$C$8)+IF(I251=14,0,Startup!$C$9)","v":137},"No"]
[25,1,2,4,7,8,10,12,15,{"$f":"IF(B252=0,0,Startup!$C$2)+IF(C252=2,0,Startup!$C$3)+IF(D252=4,0,Startup!$C$4)+IF(E252=6,0,Startup!$C$5)+IF(F252=8,0,Startup!$C$6)+IF(G252=10,0,Startup!$C$7)+IF(H252=12,0,Startup!$C$8)+IF(I252=14,0,Startup!$C$9)","v":137},"No"]
[25.1,1,2,4,7,8,10,12,15,{"$f":"IF(B253=0,0,Startup!$C$2)+IF(C253=2,0,Startup!$C$3)+IF(D253=4,0,Startup!$C$4)+IF(E253=6,0,Startup!$C$5)+IF(F253=8,0,Startup!$C$6)+IF(G253=10,0,Startup!$C$7)+IF(H253=12,0,Startup!$C$8)+IF(I253=14,0,Startup!$C$9)","v":137},"No"]
[25.2,1,2,4,7,8,10,12,15,{"$f":"IF(B254=0,0,Startup!$C$2)+IF(C254=2,0,Startup!$C$3)+IF(D254=4,0,Startup!$C$4)+IF(E254=6,0,Startup!$C$5)+IF(F254=8,0,Startup!$C$6)+IF(G254=10,0,Startup!$C$7)+IF(H254=12,0,Startup!$C$8)+IF(I254=14,0,Startup!$C$9)","v":137},"No"]
[25.3,1,2,4,7,8,10,12,15,{"$f":"IF(B255=0,0,Startup!$C$2)+IF(C255=2,0,Startup!$C$3)+IF(D255=4,0,Startup!$C$4)+IF(E255=6,0,Startup!$C$5)+IF(F255=8,0,Startup!$C$6)+IF(G255=10,0,Startup!$C$7)+IF(H255=12,0,Startup!$C$8)+IF(I255=14,0,Startup!$C$9)","v":137},"No"]
[25.4,1,2,4,7,8,10,12,15,{"$f":"IF(B256=0,0,Startup!$C$2)+IF(C256=2,0,Startup!$C$3)+IF(D256=4,0,Startup!$C$4)+IF(E256=6,0,Startup!$C$5)+IF(F256=8,0,Startup!$C$6)+IF(G256=10,0,Startup!$C$7)+IF(H256=12,0,Startup!$C$8)+IF(I256=14,0,Startup!$C$9)","v":137},"No"]
[25.5,1,2,4,7,8,10,12,15,{"$f":"IF(B257=0,0,Startup!$C$2)+IF(C257=2,0,Startup!$C$3)+IF(D257=4,0,Startup!$C$4)+IF(E257=6,0,Startup!$C$5)+IF(F257=8,0,Startup!$C$6)+IF(G257=10,0,Startup!$C$7)+IF(H257=12,0,Startup!$C$8)+IF(I257=14,0,Startup!$C$9)","v":137},"No"]
[25.6,1,2,4,7,8,10,12,15,{"$f":"IF(B258=0,0,Startup!$C$2)+IF(C258=2,0,Startup!$C$3)+IF(D258=4,0,Startup!$C$4)+IF(E258=6,0,Startup!$C$5)+IF(F258=8,0,Startup!$C$6)+IF(G258=10,0,Startup!$C$7)+IF(H258=12,0,Startup!$C$8)+IF(I258=14,0,Startup!$C$9)","v":137},"No"]
[25.7,1,2,4,7,8,10,12,15,{"$f":"IF(B259=0,0,Startup!$C$2)+IF(C259=2,0,Startup!$C$3)+IF(D259=4,0,Startup!$C$4)+IF(E259=6,0,Startup!$C$5)+IF(F259=8,0,Startup!$C$6)+IF(G259=10,0,Startup!$C$7)+IF(H259=12,0,Startup!$C$8)+IF(I259=14,0,Startup!$C$9)","v":137},"No"]
[25.8,1,2,4,7,8,10,12,15,{"$f":"IF(B260=0,0,Startup!$C$2)+IF(C260=2,0,Startup!$C$3)+IF(D260=4,0,Startup!$C$4)+IF(E260=6,0,Startup!$C$5)+IF(F260=8,0,Startup!$C$6)+IF(G260=10,0,Startup!$C$7)+IF(H260=12,0,Startup!$C$8)+IF(I260=14,0,Startup!$C$9)","v":137},{"$f":"IF(J260<>J259,\"Yes\",\"No\")","v":"No"}]
[25.9,1,2,4,7,8,10,12,15,{"$f":"IF(B261=0,0,Startup!$C$2)+IF(C261=2,0,Startup!$C$3)+IF(D261=4,0,Startup!$C$4)+IF(E261=6,0,Startup!$C$5)+IF(F261=8,0,Startup!$C$6)+IF(G261=10,0,Startup!$C$7)+IF(H261=12,0,Startup!$C$8)+IF(I261=14,0,Startup!$C$9)","v":137},"No"]
[26,1,2,4,7,8,10,12,15,{"$f":"IF(B262=0,0,Startup!$C$2)+IF(C262=2,0,Startup!$C$3)+IF(D262=4,0,Startup!$C$4)+IF(E262=6,0,Startup!$C$5)+IF(F262=8,0,Startup!$C$6)+IF(G262=10,0,Startup!$C$7)+IF(H262=12,0,Startup!$C$8)+IF(I262=14,0,Startup!$C$9)","v":137},"No"]
[26.1,1,2,4,7,8,10,12,15,{"$f":"IF(B263=0,0,Startup!$C$2)+IF(C263=2,0,Startup!$C$3)+IF(D263=4,0,Startup!$C$4)+IF(E263=6,0,Startup!$C$5)+IF(F263=8,0,Startup!$C$6)+IF(G263=10,0,Startup!$C$7)+IF(H263=12,0,Startup!$C$8)+IF(I263=14,0,Startup!$C$9)","v":137},"No"]
[26.2,1,2,4,7,8,10,12,15,{"$f":"IF(B264=0,0,Startup!$C$2)+IF(C264=2,0,Startup!$C$3)+IF(D264=4,0,Startup!$C$4)+IF(E264=6,0,Startup!$C$5)+IF(F264=8,0,Startup!$C$6)+IF(G264=10,0,Startup!$C$7)+IF(H264=12,0,Startup!$C$8)+IF(I264=14,0,Startup!$C$9)","v":137},"No"]
[26.3,1,2,4,7,8,10,12,15,{"$f":"IF(B265=0,0,Startup!$C$2)+IF(C265=2,0,Startup!$C$3)+IF(D265=4,0,Startup!$C$4)+IF(E265=6,0,Startup!$C$5)+IF(F265=8,0,Startup!$C$6)+IF(G265=10,0,Startup!$C$7)+IF(H265=12,0,Startup!$C$8)+IF(I265=14,0,Startup!$C$9)","v":137},"No"]
[26.4,1,2,4,7,8,10,12,15,{"$f":"IF(B266=0,0,Startup!$C$2)+IF(C266=2,0,Startup!$C$3)+IF(D266=4,0,Startup!$C$4)+IF(E266=6,0,Startup!$C$5)+IF(F266=8,0,Startup!$C$6)+IF(G266=10,0,Startup!$C$7)+IF(H266=12,0,Startup!$C$8)+IF(I266=14,0,Startup!$C$9)","v":137},"No"]
[26.5,1,2,4,7,8,10,12,15,{"$f":"IF(B267=0,0,Startup!$C$2)+IF(C267=2,0,Startup!$C$3)+IF(D267=4,0,Startup!$C$4)+IF(E267=6,0,Startup!$C$5)+IF(F267=8,0,Startup!$C$6)+IF(G267=10,0,Startup!$C$7)+IF(H267=12,0,Startup!$C$8)+IF(I267=14,0,Startup!$C$9)","v":137},"No"]
[26.6,1,2,4,7,8,10,12,15,{"$f":"IF(B268=0,0,Startup!$C$2)+IF(C268=2,0,Startup!$C$3)+IF(D268=4,0,Startup!$C$4)+IF(E268=6,0,Startup!$C$5)+IF(F268=8,0,Startup!$C$6)+IF(G268=10,0,Startup!$C$7)+IF(H268=12,0,Startup!$C$8)+IF(I268=14,0,Startup!$C$9)","v":137},"No"]
[26.7,1,2,4,7,8,10,12,15,{"$f":"IF(B269=0,0,Startup!$C$2)+IF(C269=2,0,Startup!$C$3)+IF(D269=4,0,Startup!$C$4)+IF(E269=6,0,Startup!$C$5)+IF(F269=8,0,Startup!$C$6)+IF(G269=10,0,Startup!$C$7)+IF(H269=12,0,Startup!$C$8)+IF(I269=14,0,Startup!$C$9)","v":137},"No"]
[26.8,1,2,4,7,8,10,12,15,{"$f":"IF(B270=0,0,Startup!$C$2)+IF(C270=2,0,Startup!$C$3)+IF(D270=4,0,Startup!$C$4)+IF(E270=6,0,Startup!$C$5)+IF(F270=8,0,Startup!$C$6)+IF(G270=10,0,Startup!$C$7)+IF(H270=12,0,Startup!$C$8)+IF(I270=14,0,Startup!$C$9)","v":137},"No"]
[26.9,1,2,4,7,8,10,12,15,{"$f":"IF(B271=0,0,Startup!$C$2)+IF(C271=2,0,Startup!$C$3)+IF(D271=4,0,Startup!$C$4)+IF(E271=6,0,Startup!$C$5)+IF(F271=8,0,Startup!$C$6)+IF(G271=10,0,Startup!$C$7)+IF(H271=12,0,Startup!$C$8)+IF(I271=14,0,Startup!$C$9)","v":137},"No"]
[27,1,2,4,7,8,10,12,15,{"$f":"IF(B272=0,0,Startup!$C$2)+IF(C272=2,0,Startup!$C$3)+IF(D272=4,0,Startup!$C$4)+IF(E272=6,0,Startup!$C$5)+IF(F272=8,0,Startup!$C$6)+IF(G272=10,0,Startup!$C$7)+IF(H272=12,0,Startup!$C$8)+IF(I272=14,0,Startup!$C$9)","v":137},"No"]
[27.1,1,2,4,7,8,10,12,15,{"$f":"IF(B273=0,0,Startup!$C$2)+IF(C273=2,0,Startup!$C$3)+IF(D273=4,0,Startup!$C$4)+IF(E273=6,0,Startup!$C$5)+IF(F273=8,0,Startup!$C$6)+IF(G273=10,0,Startup!$C$7)+IF(H273=12,0,Startup!$C$8)+IF(I273=14,0,Startup!$C$9)","v":137},"No"]
[27.2,1,2,4,7,8,10,12,15,{"$f":"IF(B274=0,0,Startup!$C$2)+IF(C274=2,0,Startup!$C$3)+IF(D274=4,0,Startup!$C$4)+IF(E274=6,0,Startup!$C$5)+IF(F274=8,0,Startup!$C$6)+IF(G274=10,0,Startup!$C$7)+IF(H274=12,0,Startup!$C$8)+IF(I274=14,0,Startup!$C$9)","v":137},"No"]
[27.3,1,2,4,7,8,10,12,15,{"$f":"IF(B275=0,0,Startup!$C$2)+IF(C275=2,0,Startup!$C$3)+IF(D275=4,0,Startup!$C$4)+IF(E275=6,0,Startup!$C$5)+IF(F275=8,0,Startup!$C$6)+IF(G275=10,0,Startup!$C$7)+IF(H275=12,0,Startup!$C$8)+IF(I275=14,0,Startup!$C$9)","v":137},"No"]
[27.4,1,2,4,7,8,10,12,15,{"$f":"IF(B276=0,0,Startup!$C$2)+IF(C276=2,0,Startup!$C$3)+IF(D276=4,0,Startup!$C$4)+IF(E276=6,0,Startup!$C$5)+IF(F276=8,0,Startup!$C$6)+IF(G276=10,0,Startup!$C$7)+IF(H276=12,0,Startup!$C$8)+IF(I276=14,0,Startup!$C$9)","v":137},"No"]
[27.5,1,2,4,7,8,10,12,15,{"$f":"IF(B277=0,0,Startup!$C$2)+IF(C277=2,0,Startup!$C$3)+IF(D277=4,0,Startup!$C$4)+IF(E277=6,0,Startup!$C$5)+IF(F277=8,0,Startup!$C$6)+IF(G277=10,0,Startup!$C$7)+IF(H277=12,0,Startup!$C$8)+IF(I277=14,0,Startup!$C$9)","v":137},"No"]
[27.6,1,2,4,7,8,10,12,15,{"$f":"IF(B278=0,0,Startup!$C$2)+IF(C278=2,0,Startup!$C$3)+IF(D278=4,0,Startup!$C$4)+IF(E278=6,0,Startup!$C$5)+IF(F278=8,0,Startup!$C$6)+IF(G278=10,0,Startup!$C$7)+IF(H278=12,0,Startup!$C$8)+IF(I278=14,0,Startup!$C$9)","v":137},"No"]
[27.7,1,2,4,7,8,10,12,15,{"$f":"IF(B279=0,0,Startup!$C$2)+IF(C279=2,0,Startup!$C$3)+IF(D279=4,0,Startup!$C$4)+IF(E279=6,0,Startup!$C$5)+IF(F279=8,0,Startup!$C$6)+IF(G279=10,0,Startup!$C$7)+IF(H279=12,0,Startup!$C$8)+IF(I279=14,0,Startup!$C$9)","v":137},"No"]
[27.8,1,2,4,7,8,10,12,15,{"$f":"IF(B280=0,0,Startup!$C$2)+IF(C280=2,0,Startup!$C$3)+IF(D280=4,0,Startup!$C$4)+IF(E280=6,0,Startup!$C$5)+IF(F280=8,0,Startup!$C$6)+IF(G280=10,0,Startup!$C$7)+IF(H280=12,0,Startup!$C$8)+IF(I280=14,0,Startup!$C$9)","v":137},"No"]
[27.9,1,2,4,7,8,10,12,15,{"$f":"IF(B281=0,0,Startup!$C$2)+IF(C281=2,0,Startup!$C$3)+IF(D281=4,0,Startup!$C$4)+IF(E281=6,0,Startup!$C$5)+IF(F281=8,0,Startup!$C$6)+IF(G281=10,0,Startup!$C$7)+IF(H281=12,0,Startup!$C$8)+IF(I281=14,0,Startup!$C$9)","v":137},"No"]
[28,1,2,4,7,8,10,12,15,{"$f":"IF(B282=0,0,Startup!$C$2)+IF(C282=2,0,Startup!$C$3)+IF(D282=4,0,Startup!$C$4)+IF(E282=6,0,Startup!$C$5)+IF(F282=8,0,Startup!$C$6)+IF(G282=10,0,Startup!$C$7)+IF(H282=12,0,Startup!$C$8)+IF(I282=14,0,Startup!$C$9)","v":137},"No"]
[28.1,1,2,4,7,8,10,12,15,{"$f":"IF(B283=0,0,Startup!$C$2)+IF(C283=2,0,Startup!$C$3)+IF(D283=4,0,Startup!$C$4)+IF(E283=6,0,Startup!$C$5)+IF(F283=8,0,Startup!$C$6)+IF(G283=10,0,Startup!$C$7)+IF(H283=12,0,Startup!$C$8)+IF(I283=14,0,Startup!$C$9)","v":137},"No"]
[28.2,1,2,4,7,8,10,12,15,{"$f":"IF(B284=0,0,Startup!$C$2)+IF(C284=2,0,Startup!$C$3)+IF(D284=4,0,Startup!$C$4)+IF(E284=6,0,Startup!$C$5)+IF(F284=8,0,Startup!$C$6)+IF(G284=10,0,Startup!$C$7)+IF(H284=12,0,Startup!$C$8)+IF(I284=14,0,Startup!$C$9)","v":137},"No"]
[28.3,1,2,4,7,8,10,12,15,{"$f":"IF(B285=0,0,Startup!$C$2)+IF(C285=2,0,Startup!$C$3)+IF(D285=4,0,Startup!$C$4)+IF(E285=6,0,Startup!$C$5)+IF(F285=8,0,Startup!$C$6)+IF(G285=10,0,Startup!$C$7)+IF(H285=12,0,Startup!$C$8)+IF(I285=14,0,Startup!$C$9)","v":137},"No"]
[28.4,1,2,4,7,8,10,12,15,{"$f":"IF(B286=0,0,Startup!$C$2)+IF(C286=2,0,Startup!$C$3)+IF(D286=4,0,Startup!$C$4)+IF(E286=6,0,Startup!$C$5)+IF(F286=8,0,Startup!$C$6)+IF(G286=10,0,Startup!$C$7)+IF(H286=12,0,Startup!$C$8)+IF(I286=14,0,Startup!$C$9)","v":137},"No"]
[28.5,1,2,4,7,8,10,12,15,{"$f":"IF(B287=0,0,Startup!$C$2)+IF(C287=2,0,Startup!$C$3)+IF(D287=4,0,Startup!$C$4)+IF(E287=6,0,Startup!$C$5)+IF(F287=8,0,Startup!$C$6)+IF(G287=10,0,Startup!$C$7)+IF(H287=12,0,Startup!$C$8)+IF(I287=14,0,Startup!$C$9)","v":137},"No"]
[28.6,1,2,4,7,8,10,12,15,{"$f":"IF(B288=0,0,Startup!$C$2)+IF(C288=2,0,Startup!$C$3)+IF(D288=4,0,Startup!$C$4)+IF(E288=6,0,Startup!$C$5)+IF(F288=8,0,Startup!$C$6)+IF(G288=10,0,Startup!$C$7)+IF(H288=12,0,Startup!$C$8)+IF(I288=14,0,Startup!$C$9)","v":137},"No"]
[28.7,1,2,4,7,8,10,12,15,{"$f":"IF(B289=0,0,Startup!$C$2)+IF(C289=2,0,Startup!$C$3)+IF(D289=4,0,Startup!$C$4)+IF(E289=6,0,Startup!$C$5)+IF(F289=8,0,Startup!$C$6)+IF(G289=10,0,Startup!$C$7)+IF(H289=12,0,Startup!$C$8)+IF(I289=14,0,Startup!$C$9)","v":137},"No"]
[28.8,1,2,4,7,8,10,12,15,{"$f":"IF(B290=0,0,Startup!$C$2)+IF(C290=2,0,Startup!$C$3)+IF(D290=4,0,Startup!$C$4)+IF(E290=6,0,Startup!$C$5)+IF(F290=8,0,Startup!$C$6)+IF(G290=10,0,Startup!$C$7)+IF(H290=12,0,Startup!$C$8)+IF(I290=14,0,Startup!$C$9)","v":137},"No"]
[28.9,1,2,4,7,8,10,12,15,{"$f":"IF(B291=0,0,Startup!$C$2)+IF(C291=2,0,Startup!$C$3)+IF(D291=4,0,Startup!$C$4)+IF(E291=6,0,Startup!$C$5)+IF(F291=8,0,Startup!$C$6)+IF(G291=10,0,Startup!$C$7)+IF(H291=12,0,Startup!$C$8)+IF(I291=14,0,Startup!$C$9)","v":137},"No"]
[29,1,2,4,7,8,10,12,15,{"$f":"IF(B292=0,0,Startup!$C$2)+IF(C292=2,0,Startup!$C$3)+IF(D292=4,0,Startup!$C$4)+IF(E292=6,0,Startup!$C$5)+IF(F292=8,0,Startup!$C$6)+IF(G292=10,0,Startup!$C$7)+IF(H292=12,0,Startup!$C$8)+IF(I292=14,0,Startup!$C$9)","v":137},"No"]
[29.1,1,2,4,7,8,10,12,15,{"$f":"IF(B293=0,0,Startup!$C$2)+IF(C293=2,0,Startup!$C$3)+IF(D293=4,0,Startup!$C$4)+IF(E293=6,0,Startup!$C$5)+IF(F293=8,0,Startup!$C$6)+IF(G293=10,0,Startup!$C$7)+IF(H293=12,0,Startup!$C$8)+IF(I293=14,0,Startup!$C$9)","v":137},"No"]
[29.2,1,2,4,7,8,10,12,15,{"$f":"IF(B294=0,0,Startup!$C$2)+IF(C294=2,0,Startup!$C$3)+IF(D294=4,0,Startup!$C$4)+IF(E294=6,0,Startup!$C$5)+IF(F294=8,0,Startup!$C$6)+IF(G294=10,0,Startup!$C$7)+IF(H294=12,0,Startup!$C$8)+IF(I294=14,0,Startup!$C$9)","v":137},"No"]
[29.3,1,2,4,7,8,10,12,15,{"$f":"IF(B295=0,0,Startup!$C$2)+IF(C295=2,0,Startup!$C$3)+IF(D295=4,0,Startup!$C$4)+IF(E295=6,0,Startup!$C$5)+IF(F295=8,0,Startup!$C$6)+IF(G295=10,0,Startup!$C$7)+IF(H295=12,0,Startup!$C$8)+IF(I295=14,0,Startup!$C$9)","v":137},"No"]
[29.4,1,2,4,7,8,10,12,15,{"$f":"IF(B296=0,0,Startup!$C$2)+IF(C296=2,0,Startup!$C$3)+IF(D296=4,0,Startup!$C$4)+IF(E296=6,0,Startup!$C$5)+IF(F296=8,0,Startup!$C$6)+IF(G296=10,0,Startup!$C$7)+IF(H296=12,0,Startup!$C$8)+IF(I296=14,0,Startup!$C$9)","v":137},"No"]
[29.5,1,2,4,7,8,10,12,15,{"$f":"IF(B297=0,0,Startup!$C$2)+IF(C297=2,0,Startup!$C$3)+IF(D297=4,0,Startup!$C$4)+IF(E297=6,0,Startup!$C$5)+IF(F297=8,0,Startup!$C$6)+IF(G297=10,0,Startup!$C$7)+IF(H297=12,0,Startup!$C$8)+IF(I297=14,0,Startup!$C$9)","v":137},"No"]
[29.6,1,2,4,7,8,10,12,15,{"$f":"IF(B298=0,0,Startup!$C$2)+IF(C298=2,0,Startup!$C$3)+IF(D298=4,0,Startup!$C$4)+IF(E298=6,0,Startup!$C$5)+IF(F298=8,0,Startup!$C$6)+IF(G298=10,0,Startup!$C$7)+IF(H298=12,0,Startup!$C$8)+IF(I298=14,0,Startup!$C$9)","v":137},"No"]
[29.7,1,2,4,7,8,10,12,15,{"$f":"IF(B299=0,0,Startup!$C$2)+IF(C299=2,0,Startup!$C$3)+IF(D299=4,0,Startup!$C$4)+IF(E299=6,0,Startup!$C$5)+IF(F299=8,0,Startup!$C$6)+IF(G299=10,0,Startup!$C$7)+IF(H299=12,0,Startup!$C$8)+IF(I299=14,0,Startup!$C$9)","v":137},"No"]
[29.8,1,2,4,7,8,10,12,15,{"$f":"IF(B300=0,0,Startup!$C$2)+IF(C300=2,0,Startup!$C$3)+IF(D300=4,0,Startup!$C$4)+IF(E300=6,0,Startup!$C$5)+IF(F300=8,0,Startup!$C$6)+IF(G300=10,0,Startup!$C$7)+IF(H300=12,0,Startup!$C$8)+IF(I300=14,0,Startup!$C$9)","v":137},"No"]
[29.9,1,2,4,7,8,10,12,15,{"$f":"IF(B301=0,0,Startup!$C$2)+IF(C301=2,0,Startup!$C$3)+IF(D301=4,0,Startup!$C$4)+IF(E301=6,0,Startup!$C$5)+IF(F301=8,0,Startup!$C$6)+IF(G301=10,0,Startup!$C$7)+IF(H301=12,0,Startup!$C$8)+IF(I301=14,0,Startup!$C$9)","v":137},"No"]
[30,1,2,4,7,8,10,12,15,{"$f":"IF(B302=0,0,Startup!$C$2)+IF(C302=2,0,Startup!$C$3)+IF(D302=4,0,Startup!$C$4)+IF(E302=6,0,Startup!$C$5)+IF(F302=8,0,Startup!$C$6)+IF(G302=10,0,Startup!$C$7)+IF(H302=12,0,Startup!$C$8)+IF(I302=14,0,Startup!$C$9)","v":137},"No"]
[30.1,1,2,4,7,8,10,12,15,{"$f":"IF(B303=0,0,Startup!$C$2)+IF(C303=2,0,Startup!$C$3)+IF(D303=4,0,Startup!$C$4)+IF(E303=6,0,Startup!$C$5)+IF(F303=8,0,Startup!$C$6)+IF(G303=10,0,Startup!$C$7)+IF(H303=12,0,Startup!$C$8)+IF(I303=14,0,Startup!$C$9)","v":137},"No"]
[30.2,1,2,4,7,8,10,12,15,{"$f":"IF(B304=0,0,Startup!$C$2)+IF(C304=2,0,Startup!$C$3)+IF(D304=4,0,Startup!$C$4)+IF(E304=6,0,Startup!$C$5)+IF(F304=8,0,Startup!$C$6)+IF(G304=10,0,Startup!$C$7)+IF(H304=12,0,Startup!$C$8)+IF(I304=14,0,Startup!$C$9)","v":137},"No"]
[30.3,1,2,4,7,8,10,12,15,{"$f":"IF(B305=0,0,Startup!$C$2)+IF(C305=2,0,Startup!$C$3)+IF(D305=4,0,Startup!$C$4)+IF(E305=6,0,Startup!$C$5)+IF(F305=8,0,Startup!$C$6)+IF(G305=10,0,Startup!$C$7)+IF(H305=12,0,Startup!$C$8)+IF(I305=14,0,Startup!$C$9)","v":137},"No"]
[30.4,1,2,4,7,8,10,12,15,{"$f":"IF(B306=0,0,Startup!$C$2)+IF(C306=2,0,Startup!$C$3)+IF(D306=4,0,Startup!$C$4)+IF(E306=6,0,Startup!$C$5)+IF(F306=8,0,Startup!$C$6)+IF(G306=10,0,Startup!$C$7)+IF(H306=12,0,Startup!$C$8)+IF(I306=14,0,Startup!$C$9)","v":137},"No"]
[30.5,1,2,4,7,8,10,12,15,{"$f":"IF(B307=0,0,Startup!$C$2)+IF(C307=2,0,Startup!$C$3)+IF(D307=4,0,Startup!$C$4)+IF(E307=6,0,Startup!$C$5)+IF(F307=8,0,Startup!$C$6)+IF(G307=10,0,Startup!$C$7)+IF(H307=12,0,Startup!$C$8)+IF(I307=14,0,Startup!$C$9)","v":137},"No"]
[30.6,1,2,4,7,8,10,12,15,{"$f":"IF(B308=0,0,Startup!$C$2)+IF(C308=2,0,Startup!$C$3)+IF(D308=4,0,Startup!$C$4)+IF(E308=6,0,Startup!$C$5)+IF(F308=8,0,Startup!$C$6)+IF(G308=10,0,Startup!$C$7)+IF(H308=12,0,Startup!$C$8)+IF(I308=14,0,Startup!$C$9)","v":137},"No"]
[30.7,1,2,4,7,8,10,12,15,{"$f":"IF(B309=0,0,Startup!$C$2)+IF(C309=2,0,Startup!$C$3)+IF(D309=4,0,Startup!$C$4)+IF(E309=6,0,Startup!$C$5)+IF(F309=8,0,Startup!$C$6)+IF(G309=10,0,Startup!$C$7)+IF(H309=12,0,Startup!$C$8)+IF(I309=14,0,Startup!$C$9)","v":137},"No"]
[30.8,1,2,4,7,8,10,12,15,{"$f":"IF(B310=0,0,Startup!$C$2)+IF(C310=2,0,Startup!$C$3)+IF(D310=4,0,Startup!$C$4)+IF(E310=6,0,Startup!$C$5)+IF(F310=8,0,Startup!$C$6)+IF(G310=10,0,Startup!$C$7)+IF(H310=12,0,Startup!$C$8)+IF(I310=14,0,Startup!$C$9)","v":137},"No"]
[30.9,1,2,4,7,8,10,12,15,{"$f":"IF(B311=0,0,Startup!$C$2)+IF(C311=2,0,Startup!$C$3)+IF(D311=4,0,Startup!$C$4)+IF(E311=6,0,Startup!$C$5)+IF(F311=8,0,Startup!$C$6)+IF(G311=10,0,Startup!$C$7)+IF(H311=12,0,Startup!$C$8)+IF(I311=14,0,Startup!$C$9)","v":137},"No"]
[31,1,2,4,7,8,10,12,15,{"$f":"IF(B312=0,0,Startup!$C$2)+IF(C312=2,0,Startup!$C$3)+IF(D312=4,0,Startup!$C$4)+IF(E312=6,0,Startup!$C$5)+IF(F312=8,0,Startup!$C$6)+IF(G312=10,0,Startup!$C$7)+IF(H312=12,0,Startup!$C$8)+IF(I312=14,0,Startup!$C$9)","v":137},"No"]
[31.1,1,2,4,7,8,10,12,15,{"$f":"IF(B313=0,0,Startup!$C$2)+IF(C313=2,0,Startup!$C$3)+IF(D313=4,0,Startup!$C$4)+IF(E313=6,0,Startup!$C$5)+IF(F313=8,0,Startup!$C$6)+IF(G313=10,0,Startup!$C$7)+IF(H313=12,0,Startup!$C$8)+IF(I313=14,0,Startup!$C$9)","v":137},"No"]
[31.2,1,2,4,7,8,10,12,15,{"$f":"IF(B314=0,0,Startup!$C$2)+IF(C314=2,0,Startup!$C$3)+IF(D314=4,0,Startup!$C$4)+IF(E314=6,0,Startup!$C$5)+IF(F314=8,0,Startup!$C$6)+IF(G314=10,0,Startup!$C$7)+IF(H314=12,0,Startup!$C$8)+IF(I314=14,0,Startup!$C$9)","v":137},"No"]
[31.3,1,2,4,7,8,10,12,15,{"$f":"IF(B315=0,0,Startup!$C$2)+IF(C315=2,0,Startup!$C$3)+IF(D315=4,0,Startup!$C$4)+IF(E315=6,0,Startup!$C$5)+IF(F315=8,0,Startup!$C$6)+IF(G315=10,0,Startup!$C$7)+IF(H315=12,0,Startup!$C$8)+IF(I315=14,0,Startup!$C$9)","v":137},"No"]
[31.4,1,2,4,7,8,10,12,15,{"$f":"IF(B316=0,0,Startup!$C$2)+IF(C316=2,0,Startup!$C$3)+IF(D316=4,0,Startup!$C$4)+IF(E316=6,0,Startup!$C$5)+IF(F316=8,0,Startup!$C$6)+IF(G316=10,0,Startup!$C$7)+IF(H316=12,0,Startup!$C$8)+IF(I316=14,0,Startup!$C$9)","v":137},"No"]
[31.5,1,2,4,7,8,10,12,15,{"$f":"IF(B317=0,0,Startup!$C$2)+IF(C317=2,0,Startup!$C$3)+IF(D317=4,0,Startup!$C$4)+IF(E317=6,0,Startup!$C$5)+IF(F317=8,0,Startup!$C$6)+IF(G317=10,0,Startup!$C$7)+IF(H317=12,0,Startup!$C$8)+IF(I317=14,0,Startup!$C$9)","v":137},"No"]
[31.6,1,2,4,7,8,10,12,15,{"$f":"IF(B318=0,0,Startup!$C$2)+IF(C318=2,0,Startup!$C$3)+IF(D318=4,0,Startup!$C$4)+IF(E318=6,0,Startup!$C$5)+IF(F318=8,0,Startup!$C$6)+IF(G318=10,0,Startup!$C$7)+IF(H318=12,0,Startup!$C$8)+IF(I318=14,0,Startup!$C$9)","v":137},"No"]
[31.7,1,2,4,7,8,10,12,15,{"$f":"IF(B319=0,0,Startup!$C$2)+IF(C319=2,0,Startup!$C$3)+IF(D319=4,0,Startup!$C$4)+IF(E319=6,0,Startup!$C$5)+IF(F319=8,0,Startup!$C$6)+IF(G319=10,0,Startup!$C$7)+IF(H319=12,0,Startup!$C$8)+IF(I319=14,0,Startup!$C$9)","v":137},"No"]
[31.8,1,2,4,7,8,10,12,15,{"$f":"IF(B320=0,0,Startup!$C$2)+IF(C320=2,0,Startup!$C$3)+IF(D320=4,0,Startup!$C$4)+IF(E320=6,0,Startup!$C$5)+IF(F320=8,0,Startup!$C$6)+IF(G320=10,0,Startup!$C$7)+IF(H320=12,0,Startup!$C$8)+IF(I320=14,0,Startup!$C$9)","v":137},"No"]
[31.9,1,2,4,7,8,10,12,15,{"$f":"IF(B321=0,0,Startup!$C$2)+IF(C321=2,0,Startup!$C$3)+IF(D321=4,0,Startup!$C$4)+IF(E321=6,0,Startup!$C$5)+IF(F321=8,0,Startup!$C$6)+IF(G321=10,0,Startup!$C$7)+IF(H321=12,0,Startup!$C$8)+IF(I321=14,0,Startup!$C$9)","v":137},"No"]
[32,1,2,4,7,8,10,12,15,{"$f":"IF(B322=0,0,Startup!$C$2)+IF(C322=2,0,Startup!$C$3)+IF(D322=4,0,Startup!$C$4)+IF(E322=6,0,Startup!$C$5)+IF(F322=8,0,Startup!$C$6)+IF(G322=10,0,Startup!$C$7)+IF(H322=12,0,Startup!$C$8)+IF(I322=14,0,Startup!$C$9)","v":137},"No"]
[32.1,1,2,4,7,8,10,12,15,{"$f":"IF(B323=0,0,Startup!$C$2)+IF(C323=2,0,Startup!$C$3)+IF(D323=4,0,Startup!$C$4)+IF(E323=6,0,Startup!$C$5)+IF(F323=8,0,Startup!$C$6)+IF(G323=10,0,Startup!$C$7)+IF(H323=12,0,Startup!$C$8)+IF(I323=14,0,Startup!$C$9)","v":137},"No"]
[32.200000000000003,1,2,4,7,8,10,12,15,{"$f":"IF(B324=0,0,Startup!$C$2)+IF(C324=2,0,Startup!$C$3)+IF(D324=4,0,Startup!$C$4)+IF(E324=6,0,Startup!$C$5)+IF(F324=8,0,Startup!$C$6)+IF(G324=10,0,Startup!$C$7)+IF(H324=12,0,Startup!$C$8)+IF(I324=14,0,Startup!$C$9)","v":137},{"$f":"IF(J324<>J323,\"Yes\",\"No\")","v":"No"}]
[32.299999999999997,1,2,4,7,8,10,12,15,{"$f":"IF(B325=0,0,Startup!$C$2)+IF(C325=2,0,Startup!$C$3)+IF(D325=4,0,Startup!$C$4)+IF(E325=6,0,Startup!$C$5)+IF(F325=8,0,Startup!$C$6)+IF(G325=10,0,Startup!$C$7)+IF(H325=12,0,Startup!$C$8)+IF(I325=14,0,Startup!$C$9)","v":137},"No"]
[32.4,1,2,4,7,8,10,12,15,{"$f":"IF(B326=0,0,Startup!$C$2)+IF(C326=2,0,Startup!$C$3)+IF(D326=4,0,Startup!$C$4)+IF(E326=6,0,Startup!$C$5)+IF(F326=8,0,Startup!$C$6)+IF(G326=10,0,Startup!$C$7)+IF(H326=12,0,Startup!$C$8)+IF(I326=14,0,Startup!$C$9)","v":137},"No"]
[32.5,1,2,4,7,8,10,12,15,{"$f":"IF(B327=0,0,Startup!$C$2)+IF(C327=2,0,Startup!$C$3)+IF(D327=4,0,Startup!$C$4)+IF(E327=6,0,Startup!$C$5)+IF(F327=8,0,Startup!$C$6)+IF(G327=10,0,Startup!$C$7)+IF(H327=12,0,Startup!$C$8)+IF(I327=14,0,Startup!$C$9)","v":137},"No"]
[32.6,1,2,4,7,8,10,12,15,{"$f":"IF(B328=0,0,Startup!$C$2)+IF(C328=2,0,Startup!$C$3)+IF(D328=4,0,Startup!$C$4)+IF(E328=6,0,Startup!$C$5)+IF(F328=8,0,Startup!$C$6)+IF(G328=10,0,Startup!$C$7)+IF(H328=12,0,Startup!$C$8)+IF(I328=14,0,Startup!$C$9)","v":137},"No"]
[32.700000000000003,1,2,4,7,8,10,12,15,{"$f":"IF(B329=0,0,Startup!$C$2)+IF(C329=2,0,Startup!$C$3)+IF(D329=4,0,Startup!$C$4)+IF(E329=6,0,Startup!$C$5)+IF(F329=8,0,Startup!$C$6)+IF(G329=10,0,Startup!$C$7)+IF(H329=12,0,Startup!$C$8)+IF(I329=14,0,Startup!$C$9)","v":137},"No"]
[32.799999999999997,1,2,4,7,8,10,12,15,{"$f":"IF(B330=0,0,Startup!$C$2)+IF(C330=2,0,Startup!$C$3)+IF(D330=4,0,Startup!$C$4)+IF(E330=6,0,Startup!$C$5)+IF(F330=8,0,Startup!$C$6)+IF(G330=10,0,Startup!$C$7)+IF(H330=12,0,Startup!$C$8)+IF(I330=14,0,Startup!$C$9)","v":137},"No"]
[32.9,1,2,4,7,8,10,12,15,{"$f":"IF(B331=0,0,Startup!$C$2)+IF(C331=2,0,Startup!$C$3)+IF(D331=4,0,Startup!$C$4)+IF(E331=6,0,Startup!$C$5)+IF(F331=8,0,Startup!$C$6)+IF(G331=10,0,Startup!$C$7)+IF(H331=12,0,Startup!$C$8)+IF(I331=14,0,Startup!$C$9)","v":137},"No"]
[33,1,2,4,7,8,10,12,15,{"$f":"IF(B332=0,0,Startup!$C$2)+IF(C332=2,0,Startup!$C$3)+IF(D332=4,0,Startup!$C$4)+IF(E332=6,0,Startup!$C$5)+IF(F332=8,0,Startup!$C$6)+IF(G332=10,0,Startup!$C$7)+IF(H332=12,0,Startup!$C$8)+IF(I332=14,0,Startup!$C$9)","v":137},"No"]
[33.1,1,2,4,7,8,10,12,15,{"$f":"IF(B333=0,0,Startup!$C$2)+IF(C333=2,0,Startup!$C$3)+IF(D333=4,0,Startup!$C$4)+IF(E333=6,0,Startup!$C$5)+IF(F333=8,0,Startup!$C$6)+IF(G333=10,0,Startup!$C$7)+IF(H333=12,0,Startup!$C$8)+IF(I333=14,0,Startup!$C$9)","v":137},"No"]
[33.200000000000003,1,2,4,7,8,10,12,15,{"$f":"IF(B334=0,0,Startup!$C$2)+IF(C334=2,0,Startup!$C$3)+IF(D334=4,0,Startup!$C$4)+IF(E334=6,0,Startup!$C$5)+IF(F334=8,0,Startup!$C$6)+IF(G334=10,0,Startup!$C$7)+IF(H334=12,0,Startup!$C$8)+IF(I334=14,0,Startup!$C$9)","v":137},"No"]
[33.299999999999997,1,2,4,7,8,10,12,15,{"$f":"IF(B335=0,0,Startup!$C$2)+IF(C335=2,0,Startup!$C$3)+IF(D335=4,0,Startup!$C$4)+IF(E335=6,0,Startup!$C$5)+IF(F335=8,0,Startup!$C$6)+IF(G335=10,0,Startup!$C$7)+IF(H335=12,0,Startup!$C$8)+IF(I335=14,0,Startup!$C$9)","v":137},"No"]
[33.4,1,2,4,7,8,10,12,15,{"$f":"IF(B336=0,0,Startup!$C$2)+IF(C336=2,0,Startup!$C$3)+IF(D336=4,0,Startup!$C$4)+IF(E336=6,0,Startup!$C$5)+IF(F336=8,0,Startup!$C$6)+IF(G336=10,0,Startup!$C$7)+IF(H336=12,0,Startup!$C$8)+IF(I336=14,0,Startup!$C$9)","v":137},"No"]
[33.5,1,2,4,7,8,10,12,15,{"$f":"IF(B337=0,0,Startup!$C$2)+IF(C337=2,0,Startup!$C$3)+IF(D337=4,0,Startup!$C$4)+IF(E337=6,0,Startup!$C$5)+IF(F337=8,0,Startup!$C$6)+IF(G337=10,0,Startup!$C$7)+IF(H337=12,0,Startup!$C$8)+IF(I337=14,0,Startup!$C$9)","v":137},"No"]
[33.6,1,2,4,7,8,10,12,15,{"$f":"IF(B338=0,0,Startup!$C$2)+IF(C338=2,0,Startup!$C$3)+IF(D338=4,0,Startup!$C$4)+IF(E338=6,0,Startup!$C$5)+IF(F338=8,0,Startup!$C$6)+IF(G338=10,0,Startup!$C$7)+IF(H338=12,0,Startup!$C$8)+IF(I338=14,0,Startup!$C$9)","v":137},"No"]
[33.700000000000003,1,2,4,7,8,10,12,15,{"$f":"IF(B339=0,0,Startup!$C$2)+IF(C339=2,0,Startup!$C$3)+IF(D339=4,0,Startup!$C$4)+IF(E339=6,0,Startup!$C$5)+IF(F339=8,0,Startup!$C$6)+IF(G339=10,0,Startup!$C$7)+IF(H339=12,0,Startup!$C$8)+IF(I339=14,0,Startup!$C$9)","v":137},"No"]
[33.799999999999997,1,2,4,7,8,10,12,15,{"$f":"IF(B340=0,0,Startup!$C$2)+IF(C340=2,0,Startup!$C$3)+IF(D340=4,0,Startup!$C$4)+IF(E340=6,0,Startup!$C$5)+IF(F340=8,0,Startup!$C$6)+IF(G340=10,0,Startup!$C$7)+IF(H340=12,0,Startup!$C$8)+IF(I340=14,0,Startup!$C$9)","v":137},"No"]
[33.9,1,2,4,7,8,10,12,15,{"$f":"IF(B341=0,0,Startup!$C$2)+IF(C341=2,0,Startup!$C$3)+IF(D341=4,0,Startup!$C$4)+IF(E341=6,0,Startup!$C$5)+IF(F341=8,0,Startup!$C$6)+IF(G341=10,0,Startup!$C$7)+IF(H341=12,0,Startup!$C$8)+IF(I341=14,0,Startup!$C$9)","v":137},"No"]
[34,1,2,4,7,8,10,12,15,{"$f":"IF(B342=0,0,Startup!$C$2)+IF(C342=2,0,Startup!$C$3)+IF(D342=4,0,Startup!$C$4)+IF(E342=6,0,Startup!$C$5)+IF(F342=8,0,Startup!$C$6)+IF(G342=10,0,Startup!$C$7)+IF(H342=12,0,Startup!$C$8)+IF(I342=14,0,Startup!$C$9)","v":137},"No"]
[34.1,1,2,4,7,8,10,12,15,{"$f":"IF(B343=0,0,Startup!$C$2)+IF(C343=2,0,Startup!$C$3)+IF(D343=4,0,Startup!$C$4)+IF(E343=6,0,Startup!$C$5)+IF(F343=8,0,Startup!$C$6)+IF(G343=10,0,Startup!$C$7)+IF(H343=12,0,Startup!$C$8)+IF(I343=14,0,Startup!$C$9)","v":137},"No"]
[34.200000000000003,1,2,4,7,8,10,12,15,{"$f":"IF(B344=0,0,Startup!$C$2)+IF(C344=2,0,Startup!$C$3)+IF(D344=4,0,Startup!$C$4)+IF(E344=6,0,Startup!$C$5)+IF(F344=8,0,Startup!$C$6)+IF(G344=10,0,Startup!$C$7)+IF(H344=12,0,Startup!$C$8)+IF(I344=14,0,Startup!$C$9)","v":137},"No"]
[34.299999999999997,1,2,4,7,8,10,12,15,{"$f":"IF(B345=0,0,Startup!$C$2)+IF(C345=2,0,Startup!$C$3)+IF(D345=4,0,Startup!$C$4)+IF(E345=6,0,Startup!$C$5)+IF(F345=8,0,Startup!$C$6)+IF(G345=10,0,Startup!$C$7)+IF(H345=12,0,Startup!$C$8)+IF(I345=14,0,Startup!$C$9)","v":137},"No"]
[34.4,1,2,4,7,8,10,12,15,{"$f":"IF(B346=0,0,Startup!$C$2)+IF(C346=2,0,Startup!$C$3)+IF(D346=4,0,Startup!$C$4)+IF(E346=6,0,Startup!$C$5)+IF(F346=8,0,Startup!$C$6)+IF(G346=10,0,Startup!$C$7)+IF(H346=12,0,Startup!$C$8)+IF(I346=14,0,Startup!$C$9)","v":137},"No"]
[34.5,1,2,4,7,8,10,12,15,{"$f":"IF(B347=0,0,Startup!$C$2)+IF(C347=2,0,Startup!$C$3)+IF(D347=4,0,Startup!$C$4)+IF(E347=6,0,Startup!$C$5)+IF(F347=8,0,Startup!$C$6)+IF(G347=10,0,Startup!$C$7)+IF(H347=12,0,Startup!$C$8)+IF(I347=14,0,Startup!$C$9)","v":137},"No"]
[34.6,1,2,4,7,8,10,12,15,{"$f":"IF(B348=0,0,Startup!$C$2)+IF(C348=2,0,Startup!$C$3)+IF(D348=4,0,Startup!$C$4)+IF(E348=6,0,Startup!$C$5)+IF(F348=8,0,Startup!$C$6)+IF(G348=10,0,Startup!$C$7)+IF(H348=12,0,Startup!$C$8)+IF(I348=14,0,Startup!$C$9)","v":137},"No"]
[34.700000000000003,1,2,4,7,8,10,12,15,{"$f":"IF(B349=0,0,Startup!$C$2)+IF(C349=2,0,Startup!$C$3)+IF(D349=4,0,Startup!$C$4)+IF(E349=6,0,Startup!$C$5)+IF(F349=8,0,Startup!$C$6)+IF(G349=10,0,Startup!$C$7)+IF(H349=12,0,Startup!$C$8)+IF(I349=14,0,Startup!$C$9)","v":137},"No"]
[34.799999999999997,1,2,4,7,8,10,12,15,{"$f":"IF(B350=0,0,Startup!$C$2)+IF(C350=2,0,Startup!$C$3)+IF(D350=4,0,Startup!$C$4)+IF(E350=6,0,Startup!$C$5)+IF(F350=8,0,Startup!$C$6)+IF(G350=10,0,Startup!$C$7)+IF(H350=12,0,Startup!$C$8)+IF(I350=14,0,Startup!$C$9)","v":137},"No"]
[34.9,1,2,4,7,8,10,12,15,{"$f":"IF(B351=0,0,Startup!$C$2)+IF(C351=2,0,Startup!$C$3)+IF(D351=4,0,Startup!$C$4)+IF(E351=6,0,Startup!$C$5)+IF(F351=8,0,Startup!$C$6)+IF(G351=10,0,Startup!$C$7)+IF(H351=12,0,Startup!$C$8)+IF(I351=14,0,Startup!$C$9)","v":137},"No"]
[35,1,2,4,7,8,11,12,15,{"$f":"IF(B352=0,0,Startup!$C$2)+IF(C352=2,0,Startup!$C$3)+IF(D352=4,0,Startup!$C$4)+IF(E352=6,0,Startup!$C$5)+IF(F352=8,0,Startup!$C$6)+IF(G352=10,0,Startup!$C$7)+IF(H352=12,0,Startup!$C$8)+IF(I352=14,0,Startup!$C$9)","v":169},"Yes"]
[35.1,1,2,4,7,8,11,12,15,{"$f":"IF(B353=0,0,Startup!$C$2)+IF(C353=2,0,Startup!$C$3)+IF(D353=4,0,Startup!$C$4)+IF(E353=6,0,Startup!$C$5)+IF(F353=8,0,Startup!$C$6)+IF(G353=10,0,Startup!$C$7)+IF(H353=12,0,Startup!$C$8)+IF(I353=14,0,Startup!$C$9)","v":169},"No"]
[35.200000000000003,1,2,4,7,8,11,12,15,{"$f":"IF(B354=0,0,Startup!$C$2)+IF(C354=2,0,Startup!$C$3)+IF(D354=4,0,Startup!$C$4)+IF(E354=6,0,Startup!$C$5)+IF(F354=8,0,Startup!$C$6)+IF(G354=10,0,Startup!$C$7)+IF(H354=12,0,Startup!$C$8)+IF(I354=14,0,Startup!$C$9)","v":169},"No"]
[35.299999999999997,1,2,4,7,8,11,12,15,{"$f":"IF(B355=0,0,Startup!$C$2)+IF(C355=2,0,Startup!$C$3)+IF(D355=4,0,Startup!$C$4)+IF(E355=6,0,Startup!$C$5)+IF(F355=8,0,Startup!$C$6)+IF(G355=10,0,Startup!$C$7)+IF(H355=12,0,Startup!$C$8)+IF(I355=14,0,Startup!$C$9)","v":169},"No"]
[35.4,1,2,4,7,8,11,12,15,{"$f":"IF(B356=0,0,Startup!$C$2)+IF(C356=2,0,Startup!$C$3)+IF(D356=4,0,Startup!$C$4)+IF(E356=6,0,Startup!$C$5)+IF(F356=8,0,Startup!$C$6)+IF(G356=10,0,Startup!$C$7)+IF(H356=12,0,Startup!$C$8)+IF(I356=14,0,Startup!$C$9)","v":169},"No"]
[35.5,1,2,4,7,8,10,12,15,{"$f":"IF(B357=0,0,Startup!$C$2)+IF(C357=2,0,Startup!$C$3)+IF(D357=4,0,Startup!$C$4)+IF(E357=6,0,Startup!$C$5)+IF(F357=8,0,Startup!$C$6)+IF(G357=10,0,Startup!$C$7)+IF(H357=12,0,Startup!$C$8)+IF(I357=14,0,Startup!$C$9)","v":137},"Yes"]
[35.6,1,2,4,7,8,10,12,15,{"$f":"IF(B358=0,0,Startup!$C$2)+IF(C358=2,0,Startup!$C$3)+IF(D358=4,0,Startup!$C$4)+IF(E358=6,0,Startup!$C$5)+IF(F358=8,0,Startup!$C$6)+IF(G358=10,0,Startup!$C$7)+IF(H358=12,0,Startup!$C$8)+IF(I358=14,0,Startup!$C$9)","v":137},"No"]
[35.700000000000003,1,2,4,7,8,10,12,15,{"$f":"IF(B359=0,0,Startup!$C$2)+IF(C359=2,0,Startup!$C$3)+IF(D359=4,0,Startup!$C$4)+IF(E359=6,0,Startup!$C$5)+IF(F359=8,0,Startup!$C$6)+IF(G359=10,0,Startup!$C$7)+IF(H359=12,0,Startup!$C$8)+IF(I359=14,0,Startup!$C$9)","v":137},"No"]
[35.799999999999997,1,2,4,7,8,10,12,15,{"$f":"IF(B360=0,0,Startup!$C$2)+IF(C360=2,0,Startup!$C$3)+IF(D360=4,0,Startup!$C$4)+IF(E360=6,0,Startup!$C$5)+IF(F360=8,0,Startup!$C$6)+IF(G360=10,0,Startup!$C$7)+IF(H360=12,0,Startup!$C$8)+IF(I360=14,0,Startup!$C$9)","v":137},"No"]
[35.9,1,2,4,7,8,10,12,15,{"$f":"IF(B361=0,0,Startup!$C$2)+IF(C361=2,0,Startup!$C$3)+IF(D361=4,0,Startup!$C$4)+IF(E361=6,0,Startup!$C$5)+IF(F361=8,0,Startup!$C$6)+IF(G361=10,0,Startup!$C$7)+IF(H361=12,0,Startup!$C$8)+IF(I361=14,0,Startup!$C$9)","v":137},"No"]
[36,1,2,4,7,8,10,13,15,{"$f":"IF(B362=0,0,Startup!$C$2)+IF(C362=2,0,Startup!$C$3)+IF(D362=4,0,Startup!$C$4)+IF(E362=6,0,Startup!$C$5)+IF(F362=8,0,Startup!$C$6)+IF(G362=10,0,Startup!$C$7)+IF(H362=12,0,Startup!$C$8)+IF(I362=14,0,Startup!$C$9)","v":201},"Yes"]
[36.1,1,2,4,7,8,10,13,15,{"$f":"IF(B363=0,0,Startup!$C$2)+IF(C363=2,0,Startup!$C$3)+IF(D363=4,0,Startup!$C$4)+IF(E363=6,0,Startup!$C$5)+IF(F363=8,0,Startup!$C$6)+IF(G363=10,0,Startup!$C$7)+IF(H363=12,0,Startup!$C$8)+IF(I363=14,0,Startup!$C$9)","v":201},"No"]
[36.200000000000003,1,2,4,7,8,10,13,15,{"$f":"IF(B364=0,0,Startup!$C$2)+IF(C364=2,0,Startup!$C$3)+IF(D364=4,0,Startup!$C$4)+IF(E364=6,0,Startup!$C$5)+IF(F364=8,0,Startup!$C$6)+IF(G364=10,0,Startup!$C$7)+IF(H364=12,0,Startup!$C$8)+IF(I364=14,0,Startup!$C$9)","v":201},"No"]
[36.299999999999997,1,2,4,7,8,10,13,15,{"$f":"IF(B365=0,0,Startup!$C$2)+IF(C365=2,0,Startup!$C$3)+IF(D365=4,0,Startup!$C$4)+IF(E365=6,0,Startup!$C$5)+IF(F365=8,0,Startup!$C$6)+IF(G365=10,0,Startup!$C$7)+IF(H365=12,0,Startup!$C$8)+IF(I365=14,0,Startup!$C$9)","v":201},"No"]
[36.4,1,2,4,7,8,10,13,15,{"$f":"IF(B366=0,0,Startup!$C$2)+IF(C366=2,0,Startup!$C$3)+IF(D366=4,0,Startup!$C$4)+IF(E366=6,0,Startup!$C$5)+IF(F366=8,0,Startup!$C$6)+IF(G366=10,0,Startup!$C$7)+IF(H366=12,0,Startup!$C$8)+IF(I366=14,0,Startup!$C$9)","v":201},"No"]
[36.5,1,2,4,7,8,10,12,15,{"$f":"IF(B367=0,0,Startup!$C$2)+IF(C367=2,0,Startup!$C$3)+IF(D367=4,0,Startup!$C$4)+IF(E367=6,0,Startup!$C$5)+IF(F367=8,0,Startup!$C$6)+IF(G367=10,0,Startup!$C$7)+IF(H367=12,0,Startup!$C$8)+IF(I367=14,0,Startup!$C$9)","v":137},"Yes"]
[36.6,1,2,4,7,8,10,12,15,{"$f":"IF(B368=0,0,Startup!$C$2)+IF(C368=2,0,Startup!$C$3)+IF(D368=4,0,Startup!$C$4)+IF(E368=6,0,Startup!$C$5)+IF(F368=8,0,Startup!$C$6)+IF(G368=10,0,Startup!$C$7)+IF(H368=12,0,Startup!$C$8)+IF(I368=14,0,Startup!$C$9)","v":137},"No"]
[36.700000000000003,1,2,4,7,8,10,12,15,{"$f":"IF(B369=0,0,Startup!$C$2)+IF(C369=2,0,Startup!$C$3)+IF(D369=4,0,Startup!$C$4)+IF(E369=6,0,Startup!$C$5)+IF(F369=8,0,Startup!$C$6)+IF(G369=10,0,Startup!$C$7)+IF(H369=12,0,Startup!$C$8)+IF(I369=14,0,Startup!$C$9)","v":137},"No"]
[36.799999999999997,1,2,4,7,8,10,12,15,{"$f":"IF(B370=0,0,Startup!$C$2)+IF(C370=2,0,Startup!$C$3)+IF(D370=4,0,Startup!$C$4)+IF(E370=6,0,Startup!$C$5)+IF(F370=8,0,Startup!$C$6)+IF(G370=10,0,Startup!$C$7)+IF(H370=12,0,Startup!$C$8)+IF(I370=14,0,Startup!$C$9)","v":137},"No"]
[36.9,1,2,4,7,8,10,12,15,{"$f":"IF(B371=0,0,Startup!$C$2)+IF(C371=2,0,Startup!$C$3)+IF(D371=4,0,Startup!$C$4)+IF(E371=6,0,Startup!$C$5)+IF(F371=8,0,Startup!$C$6)+IF(G371=10,0,Startup!$C$7)+IF(H371=12,0,Startup!$C$8)+IF(I371=14,0,Startup!$C$9)","v":137},"No"]
[37,1,2,4,7,8,10,13,15,{"$f":"IF(B372=0,0,Startup!$C$2)+IF(C372=2,0,Startup!$C$3)+IF(D372=4,0,Startup!$C$4)+IF(E372=6,0,Startup!$C$5)+IF(F372=8,0,Startup!$C$6)+IF(G372=10,0,Startup!$C$7)+IF(H372=12,0,Startup!$C$8)+IF(I372=14,0,Startup!$C$9)","v":201},"Yes"]
[37.1,1,2,4,7,8,10,13,15,{"$f":"IF(B373=0,0,Startup!$C$2)+IF(C373=2,0,Startup!$C$3)+IF(D373=4,0,Startup!$C$4)+IF(E373=6,0,Startup!$C$5)+IF(F373=8,0,Startup!$C$6)+IF(G373=10,0,Startup!$C$7)+IF(H373=12,0,Startup!$C$8)+IF(I373=14,0,Startup!$C$9)","v":201},"No"]
[37.200000000000003,1,2,4,7,8,10,13,15,{"$f":"IF(B374=0,0,Startup!$C$2)+IF(C374=2,0,Startup!$C$3)+IF(D374=4,0,Startup!$C$4)+IF(E374=6,0,Startup!$C$5)+IF(F374=8,0,Startup!$C$6)+IF(G374=10,0,Startup!$C$7)+IF(H374=12,0,Startup!$C$8)+IF(I374=14,0,Startup!$C$9)","v":201},"No"]
[37.299999999999997,1,2,4,7,8,10,13,15,{"$f":"IF(B375=0,0,Startup!$C$2)+IF(C375=2,0,Startup!$C$3)+IF(D375=4,0,Startup!$C$4)+IF(E375=6,0,Startup!$C$5)+IF(F375=8,0,Startup!$C$6)+IF(G375=10,0,Startup!$C$7)+IF(H375=12,0,Startup!$C$8)+IF(I375=14,0,Startup!$C$9)","v":201},"No"]
[37.4,1,2,4,7,8,10,13,15,{"$f":"IF(B376=0,0,Startup!$C$2)+IF(C376=2,0,Startup!$C$3)+IF(D376=4,0,Startup!$C$4)+IF(E376=6,0,Startup!$C$5)+IF(F376=8,0,Startup!$C$6)+IF(G376=10,0,Startup!$C$7)+IF(H376=12,0,Startup!$C$8)+IF(I376=14,0,Startup!$C$9)","v":201},"No"]
[37.5,1,2,4,7,8,10,12,15,{"$f":"IF(B377=0,0,Startup!$C$2)+IF(C377=2,0,Startup!$C$3)+IF(D377=4,0,Startup!$C$4)+IF(E377=6,0,Startup!$C$5)+IF(F377=8,0,Startup!$C$6)+IF(G377=10,0,Startup!$C$7)+IF(H377=12,0,Startup!$C$8)+IF(I377=14,0,Startup!$C$9)","v":137},"Yes"]
[37.6,1,2,4,7,8,10,12,15,{"$f":"IF(B378=0,0,Startup!$C$2)+IF(C378=2,0,Startup!$C$3)+IF(D378=4,0,Startup!$C$4)+IF(E378=6,0,Startup!$C$5)+IF(F378=8,0,Startup!$C$6)+IF(G378=10,0,Startup!$C$7)+IF(H378=12,0,Startup!$C$8)+IF(I378=14,0,Startup!$C$9)","v":137},"No"]
[37.700000000000003,1,2,4,7,8,10,12,15,{"$f":"IF(B379=0,0,Startup!$C$2)+IF(C379=2,0,Startup!$C$3)+IF(D379=4,0,Startup!$C$4)+IF(E379=6,0,Startup!$C$5)+IF(F379=8,0,Startup!$C$6)+IF(G379=10,0,Startup!$C$7)+IF(H379=12,0,Startup!$C$8)+IF(I379=14,0,Startup!$C$9)","v":137},"No"]
[37.799999999999997,1,2,4,7,8,10,12,15,{"$f":"IF(B380=0,0,Startup!$C$2)+IF(C380=2,0,Startup!$C$3)+IF(D380=4,0,Startup!$C$4)+IF(E380=6,0,Startup!$C$5)+IF(F380=8,0,Startup!$C$6)+IF(G380=10,0,Startup!$C$7)+IF(H380=12,0,Startup!$C$8)+IF(I380=14,0,Startup!$C$9)","v":137},"No"]
[37.9,1,2,4,7,8,10,12,15,{"$f":"IF(B381=0,0,Startup!$C$2)+IF(C381=2,0,Startup!$C$3)+IF(D381=4,0,Startup!$C$4)+IF(E381=6,0,Startup!$C$5)+IF(F381=8,0,Startup!$C$6)+IF(G381=10,0,Startup!$C$7)+IF(H381=12,0,Startup!$C$8)+IF(I381=14,0,Startup!$C$9)","v":137},"No"]
[38,1,2,4,7,8,11,12,15,{"$f":"IF(B382=0,0,Startup!$C$2)+IF(C382=2,0,Startup!$C$3)+IF(D382=4,0,Startup!$C$4)+IF(E382=6,0,Startup!$C$5)+IF(F382=8,0,Startup!$C$6)+IF(G382=10,0,Startup!$C$7)+IF(H382=12,0,Startup!$C$8)+IF(I382=14,0,Startup!$C$9)","v":169},"Yes"]
[38.1,1,2,4,7,8,11,12,15,{"$f":"IF(B383=0,0,Startup!$C$2)+IF(C383=2,0,Startup!$C$3)+IF(D383=4,0,Startup!$C$4)+IF(E383=6,0,Startup!$C$5)+IF(F383=8,0,Startup!$C$6)+IF(G383=10,0,Startup!$C$7)+IF(H383=12,0,Startup!$C$8)+IF(I383=14,0,Startup!$C$9)","v":169},"No"]
[38.200000000000003,1,2,4,7,8,11,12,15,{"$f":"IF(B384=0,0,Startup!$C$2)+IF(C384=2,0,Startup!$C$3)+IF(D384=4,0,Startup!$C$4)+IF(E384=6,0,Startup!$C$5)+IF(F384=8,0,Startup!$C$6)+IF(G384=10,0,Startup!$C$7)+IF(H384=12,0,Startup!$C$8)+IF(I384=14,0,Startup!$C$9)","v":169},"No"]
[38.299999999999997,1,2,4,7,8,11,12,15,{"$f":"IF(B385=0,0,Startup!$C$2)+IF(C385=2,0,Startup!$C$3)+IF(D385=4,0,Startup!$C$4)+IF(E385=6,0,Startup!$C$5)+IF(F385=8,0,Startup!$C$6)+IF(G385=10,0,Startup!$C$7)+IF(H385=12,0,Startup!$C$8)+IF(I385=14,0,Startup!$C$9)","v":169},"No"]
[38.4,1,2,4,7,8,11,12,15,{"$f":"IF(B386=0,0,Startup!$C$2)+IF(C386=2,0,Startup!$C$3)+IF(D386=4,0,Startup!$C$4)+IF(E386=6,0,Startup!$C$5)+IF(F386=8,0,Startup!$C$6)+IF(G386=10,0,Startup!$C$7)+IF(H386=12,0,Startup!$C$8)+IF(I386=14,0,Startup!$C$9)","v":169},"No"]
[38.5,1,2,4,7,8,10,12,15,{"$f":"IF(B387=0,0,Startup!$C$2)+IF(C387=2,0,Startup!$C$3)+IF(D387=4,0,Startup!$C$4)+IF(E387=6,0,Startup!$C$5)+IF(F387=8,0,Startup!$C$6)+IF(G387=10,0,Startup!$C$7)+IF(H387=12,0,Startup!$C$8)+IF(I387=14,0,Startup!$C$9)","v":137},"Yes"]
[38.6,1,2,4,7,8,10,12,15,{"$f":"IF(B388=0,0,Startup!$C$2)+IF(C388=2,0,Startup!$C$3)+IF(D388=4,0,Startup!$C$4)+IF(E388=6,0,Startup!$C$5)+IF(F388=8,0,Startup!$C$6)+IF(G388=10,0,Startup!$C$7)+IF(H388=12,0,Startup!$C$8)+IF(I388=14,0,Startup!$C$9)","v":137},{"$f":"IF(J388<>J387,\"Yes\",\"No\")","v":"No"}]
[38.700000000000003,1,2,4,7,8,10,12,15,{"$f":"IF(B389=0,0,Startup!$C$2)+IF(C389=2,0,Startup!$C$3)+IF(D389=4,0,Startup!$C$4)+IF(E389=6,0,Startup!$C$5)+IF(F389=8,0,Startup!$C$6)+IF(G389=10,0,Startup!$C$7)+IF(H389=12,0,Startup!$C$8)+IF(I389=14,0,Startup!$C$9)","v":137},"No"]
[38.799999999999997,1,2,4,7,8,10,12,15,{"$f":"IF(B390=0,0,Startup!$C$2)+IF(C390=2,0,Startup!$C$3)+IF(D390=4,0,Startup!$C$4)+IF(E390=6,0,Startup!$C$5)+IF(F390=8,0,Startup!$C$6)+IF(G390=10,0,Startup!$C$7)+IF(H390=12,0,Startup!$C$8)+IF(I390=14,0,Startup!$C$9)","v":137},"No"]
[38.9,1,2,4,7,8,10,12,15,{"$f":"IF(B391=0,0,Startup!$C$2)+IF(C391=2,0,Startup!$C$3)+IF(D391=4,0,Startup!$C$4)+IF(E391=6,0,Startup!$C$5)+IF(F391=8,0,Startup!$C$6)+IF(G391=10,0,Startup!$C$7)+IF(H391=12,0,Startup!$C$8)+IF(I391=14,0,Startup!$C$9)","v":137},"No"]
[39,1,2,4,7,8,10,12,15,{"$f":"IF(B392=0,0,Startup!$C$2)+IF(C392=2,0,Startup!$C$3)+IF(D392=4,0,Startup!$C$4)+IF(E392=6,0,Startup!$C$5)+IF(F392=8,0,Startup!$C$6)+IF(G392=10,0,Startup!$C$7)+IF(H392=12,0,Startup!$C$8)+IF(I392=14,0,Startup!$C$9)","v":137},"No"]
[39.1,1,2,4,7,8,10,12,15,{"$f":"IF(B393=0,0,Startup!$C$2)+IF(C393=2,0,Startup!$C$3)+IF(D393=4,0,Startup!$C$4)+IF(E393=6,0,Startup!$C$5)+IF(F393=8,0,Startup!$C$6)+IF(G393=10,0,Startup!$C$7)+IF(H393=12,0,Startup!$C$8)+IF(I393=14,0,Startup!$C$9)","v":137},"No"]
[39.200000000000003,1,2,4,7,8,10,12,15,{"$f":"IF(B394=0,0,Startup!$C$2)+IF(C394=2,0,Startup!$C$3)+IF(D394=4,0,Startup!$C$4)+IF(E394=6,0,Startup!$C$5)+IF(F394=8,0,Startup!$C$6)+IF(G394=10,0,Startup!$C$7)+IF(H394=12,0,Startup!$C$8)+IF(I394=14,0,Startup!$C$9)","v":137},"No"]
[39.299999999999997,1,2,4,7,8,10,12,15,{"$f":"IF(B395=0,0,Startup!$C$2)+IF(C395=2,0,Startup!$C$3)+IF(D395=4,0,Startup!$C$4)+IF(E395=6,0,Startup!$C$5)+IF(F395=8,0,Startup!$C$6)+IF(G395=10,0,Startup!$C$7)+IF(H395=12,0,Startup!$C$8)+IF(I395=14,0,Startup!$C$9)","v":137},"No"]
[39.4,1,2,4,7,8,10,12,15,{"$f":"IF(B396=0,0,Startup!$C$2)+IF(C396=2,0,Startup!$C$3)+IF(D396=4,0,Startup!$C$4)+IF(E396=6,0,Startup!$C$5)+IF(F396=8,0,Startup!$C$6)+IF(G396=10,0,Startup!$C$7)+IF(H396=12,0,Startup!$C$8)+IF(I396=14,0,Startup!$C$9)","v":137},"No"]
[39.5,1,2,4,7,8,10,12,15,{"$f":"IF(B397=0,0,Startup!$C$2)+IF(C397=2,0,Startup!$C$3)+IF(D397=4,0,Startup!$C$4)+IF(E397=6,0,Startup!$C$5)+IF(F397=8,0,Startup!$C$6)+IF(G397=10,0,Startup!$C$7)+IF(H397=12,0,Startup!$C$8)+IF(I397=14,0,Startup!$C$9)","v":137},"No"]
[39.6,1,2,4,7,8,10,12,15,{"$f":"IF(B398=0,0,Startup!$C$2)+IF(C398=2,0,Startup!$C$3)+IF(D398=4,0,Startup!$C$4)+IF(E398=6,0,Startup!$C$5)+IF(F398=8,0,Startup!$C$6)+IF(G398=10,0,Startup!$C$7)+IF(H398=12,0,Startup!$C$8)+IF(I398=14,0,Startup!$C$9)","v":137},"No"]
[39.700000000000003,1,2,4,7,8,10,12,15,{"$f":"IF(B399=0,0,Startup!$C$2)+IF(C399=2,0,Startup!$C$3)+IF(D399=4,0,Startup!$C$4)+IF(E399=6,0,Startup!$C$5)+IF(F399=8,0,Startup!$C$6)+IF(G399=10,0,Startup!$C$7)+IF(H399=12,0,Startup!$C$8)+IF(I399=14,0,Startup!$C$9)","v":137},"No"]
[39.799999999999997,1,2,4,7,8,10,12,15,{"$f":"IF(B400=0,0,Startup!$C$2)+IF(C400=2,0,Startup!$C$3)+IF(D400=4,0,Startup!$C$4)+IF(E400=6,0,Startup!$C$5)+IF(F400=8,0,Startup!$C$6)+IF(G400=10,0,Startup!$C$7)+IF(H400=12,0,Startup!$C$8)+IF(I400=14,0,Startup!$C$9)","v":137},"No"]
[39.9,1,2,4,7,8,10,12,15,{"$f":"IF(B401=0,0,Startup!$C$2)+IF(C401=2,0,Startup!$C$3)+IF(D401=4,0,Startup!$C$4)+IF(E401=6,0,Startup!$C$5)+IF(F401=8,0,Startup!$C$6)+IF(G401=10,0,Startup!$C$7)+IF(H401=12,0,Startup!$C$8)+IF(I401=14,0,Startup!$C$9)","v":137},"No"]
[40,1,2,4,7,8,10,12,15,{"$f":"IF(B402=0,0,Startup!$C$2)+IF(C402=2,0,Startup!$C$3)+IF(D402=4,0,Startup!$C$4)+IF(E402=6,0,Startup!$C$5)+IF(F402=8,0,Startup!$C$6)+IF(G402=10,0,Startup!$C$7)+IF(H402=12,0,Startup!$C$8)+IF(I402=14,0,Startup!$C$9)","v":137},"No"]
[40.1,1,2,4,7,8,10,12,15,{"$f":"IF(B403=0,0,Startup!$C$2)+IF(C403=2,0,Startup!$C$3)+IF(D403=4,0,Startup!$C$4)+IF(E403=6,0,Startup!$C$5)+IF(F403=8,0,Startup!$C$6)+IF(G403=10,0,Startup!$C$7)+IF(H403=12,0,Startup!$C$8)+IF(I403=14,0,Startup!$C$9)","v":137},"No"]
[40.200000000000003,1,2,4,7,8,10,12,15,{"$f":"IF(B404=0,0,Startup!$C$2)+IF(C404=2,0,Startup!$C$3)+IF(D404=4,0,Startup!$C$4)+IF(E404=6,0,Startup!$C$5)+IF(F404=8,0,Startup!$C$6)+IF(G404=10,0,Startup!$C$7)+IF(H404=12,0,Startup!$C$8)+IF(I404=14,0,Startup!$C$9)","v":137},"No"]
[40.299999999999997,1,2,4,7,8,10,12,15,{"$f":"IF(B405=0,0,Startup!$C$2)+IF(C405=2,0,Startup!$C$3)+IF(D405=4,0,Startup!$C$4)+IF(E405=6,0,Startup!$C$5)+IF(F405=8,0,Startup!$C$6)+IF(G405=10,0,Startup!$C$7)+IF(H405=12,0,Startup!$C$8)+IF(I405=14,0,Startup!$C$9)","v":137},"No"]
[40.4,1,2,4,7,8,10,12,15,{"$f":"IF(B406=0,0,Startup!$C$2)+IF(C406=2,0,Startup!$C$3)+IF(D406=4,0,Startup!$C$4)+IF(E406=6,0,Startup!$C$5)+IF(F406=8,0,Startup!$C$6)+IF(G406=10,0,Startup!$C$7)+IF(H406=12,0,Startup!$C$8)+IF(I406=14,0,Startup!$C$9)","v":137},"No"]
[40.5,1,2,4,7,8,10,12,15,{"$f":"IF(B407=0,0,Startup!$C$2)+IF(C407=2,0,Startup!$C$3)+IF(D407=4,0,Startup!$C$4)+IF(E407=6,0,Startup!$C$5)+IF(F407=8,0,Startup!$C$6)+IF(G407=10,0,Startup!$C$7)+IF(H407=12,0,Startup!$C$8)+IF(I407=14,0,Startup!$C$9)","v":137},"No"]
[40.6,1,2,4,7,8,10,12,15,{"$f":"IF(B408=0,0,Startup!$C$2)+IF(C408=2,0,Startup!$C$3)+IF(D408=4,0,Startup!$C$4)+IF(E408=6,0,Startup!$C$5)+IF(F408=8,0,Startup!$C$6)+IF(G408=10,0,Startup!$C$7)+IF(H408=12,0,Startup!$C$8)+IF(I408=14,0,Startup!$C$9)","v":137},"No"]
[40.700000000000003,1,2,4,7,8,10,12,15,{"$f":"IF(B409=0,0,Startup!$C$2)+IF(C409=2,0,Startup!$C$3)+IF(D409=4,0,Startup!$C$4)+IF(E409=6,0,Startup!$C$5)+IF(F409=8,0,Startup!$C$6)+IF(G409=10,0,Startup!$C$7)+IF(H409=12,0,Startup!$C$8)+IF(I409=14,0,Startup!$C$9)","v":137},"No"]
[40.799999999999997,1,2,4,7,8,10,12,15,{"$f":"IF(B410=0,0,Startup!$C$2)+IF(C410=2,0,Startup!$C$3)+IF(D410=4,0,Startup!$C$4)+IF(E410=6,0,Startup!$C$5)+IF(F410=8,0,Startup!$C$6)+IF(G410=10,0,Startup!$C$7)+IF(H410=12,0,Startup!$C$8)+IF(I410=14,0,Startup!$C$9)","v":137},"No"]
[40.9,1,2,4,7,8,10,12,15,{"$f":"IF(B411=0,0,Startup!$C$2)+IF(C411=2,0,Startup!$C$3)+IF(D411=4,0,Startup!$C$4)+IF(E411=6,0,Startup!$C$5)+IF(F411=8,0,Startup!$C$6)+IF(G411=10,0,Startup!$C$7)+IF(H411=12,0,Startup!$C$8)+IF(I411=14,0,Startup!$C$9)","v":137},"No"]
[41,1,2,4,7,8,10,12,15,{"$f":"IF(B412=0,0,Startup!$C$2)+IF(C412=2,0,Startup!$C$3)+IF(D412=4,0,Startup!$C$4)+IF(E412=6,0,Startup!$C$5)+IF(F412=8,0,Startup!$C$6)+IF(G412=10,0,Startup!$C$7)+IF(H412=12,0,Startup!$C$8)+IF(I412=14,0,Startup!$C$9)","v":137},"No"]
[41.1,1,2,4,7,8,10,12,15,{"$f":"IF(B413=0,0,Startup!$C$2)+IF(C413=2,0,Startup!$C$3)+IF(D413=4,0,Startup!$C$4)+IF(E413=6,0,Startup!$C$5)+IF(F413=8,0,Startup!$C$6)+IF(G413=10,0,Startup!$C$7)+IF(H413=12,0,Startup!$C$8)+IF(I413=14,0,Startup!$C$9)","v":137},"No"]
[41.2,1,2,4,7,8,10,12,15,{"$f":"IF(B414=0,0,Startup!$C$2)+IF(C414=2,0,Startup!$C$3)+IF(D414=4,0,Startup!$C$4)+IF(E414=6,0,Startup!$C$5)+IF(F414=8,0,Startup!$C$6)+IF(G414=10,0,Startup!$C$7)+IF(H414=12,0,Startup!$C$8)+IF(I414=14,0,Startup!$C$9)","v":137},"No"]
[41.3,1,2,4,7,8,10,12,15,{"$f":"IF(B415=0,0,Startup!$C$2)+IF(C415=2,0,Startup!$C$3)+IF(D415=4,0,Startup!$C$4)+IF(E415=6,0,Startup!$C$5)+IF(F415=8,0,Startup!$C$6)+IF(G415=10,0,Startup!$C$7)+IF(H415=12,0,Startup!$C$8)+IF(I415=14,0,Startup!$C$9)","v":137},"No"]
[41.4,1,2,4,7,8,10,12,15,{"$f":"IF(B416=0,0,Startup!$C$2)+IF(C416=2,0,Startup!$C$3)+IF(D416=4,0,Startup!$C$4)+IF(E416=6,0,Startup!$C$5)+IF(F416=8,0,Startup!$C$6)+IF(G416=10,0,Startup!$C$7)+IF(H416=12,0,Startup!$C$8)+IF(I416=14,0,Startup!$C$9)","v":137},"No"]
[41.5,1,2,4,7,8,10,12,15,{"$f":"IF(B417=0,0,Startup!$C$2)+IF(C417=2,0,Startup!$C$3)+IF(D417=4,0,Startup!$C$4)+IF(E417=6,0,Startup!$C$5)+IF(F417=8,0,Startup!$C$6)+IF(G417=10,0,Startup!$C$7)+IF(H417=12,0,Startup!$C$8)+IF(I417=14,0,Startup!$C$9)","v":137},"No"]
[41.6,1,2,4,7,8,10,12,15,{"$f":"IF(B418=0,0,Startup!$C$2)+IF(C418=2,0,Startup!$C$3)+IF(D418=4,0,Startup!$C$4)+IF(E418=6,0,Startup!$C$5)+IF(F418=8,0,Startup!$C$6)+IF(G418=10,0,Startup!$C$7)+IF(H418=12,0,Startup!$C$8)+IF(I418=14,0,Startup!$C$9)","v":137},"No"]
[41.7,1,2,4,7,8,10,12,15,{"$f":"IF(B419=0,0,Startup!$C$2)+IF(C419=2,0,Startup!$C$3)+IF(D419=4,0,Startup!$C$4)+IF(E419=6,0,Startup!$C$5)+IF(F419=8,0,Startup!$C$6)+IF(G419=10,0,Startup!$C$7)+IF(H419=12,0,Startup!$C$8)+IF(I419=14,0,Startup!$C$9)","v":137},"No"]
[41.8,1,2,4,7,8,10,12,15,{"$f":"IF(B420=0,0,Startup!$C$2)+IF(C420=2,0,Startup!$C$3)+IF(D420=4,0,Startup!$C$4)+IF(E420=6,0,Startup!$C$5)+IF(F420=8,0,Startup!$C$6)+IF(G420=10,0,Startup!$C$7)+IF(H420=12,0,Startup!$C$8)+IF(I420=14,0,Startup!$C$9)","v":137},"No"]
[41.9,1,2,4,7,8,10,12,15,{"$f":"IF(B421=0,0,Startup!$C$2)+IF(C421=2,0,Startup!$C$3)+IF(D421=4,0,Startup!$C$4)+IF(E421=6,0,Startup!$C$5)+IF(F421=8,0,Startup!$C$6)+IF(G421=10,0,Startup!$C$7)+IF(H421=12,0,Startup!$C$8)+IF(I421=14,0,Startup!$C$9)","v":137},"No"]
[42,1,2,4,7,8,10,12,15,{"$f":"IF(B422=0,0,Startup!$C$2)+IF(C422=2,0,Startup!$C$3)+IF(D422=4,0,Startup!$C$4)+IF(E422=6,0,Startup!$C$5)+IF(F422=8,0,Startup!$C$6)+IF(G422=10,0,Startup!$C$7)+IF(H422=12,0,Startup!$C$8)+IF(I422=14,0,Startup!$C$9)","v":137},"No"]
[42.1,1,2,4,7,8,10,12,15,{"$f":"IF(B423=0,0,Startup!$C$2)+IF(C423=2,0,Startup!$C$3)+IF(D423=4,0,Startup!$C$4)+IF(E423=6,0,Startup!$C$5)+IF(F423=8,0,Startup!$C$6)+IF(G423=10,0,Startup!$C$7)+IF(H423=12,0,Startup!$C$8)+IF(I423=14,0,Startup!$C$9)","v":137},"No"]
[42.2,1,2,4,7,8,10,12,15,{"$f":"IF(B424=0,0,Startup!$C$2)+IF(C424=2,0,Startup!$C$3)+IF(D424=4,0,Startup!$C$4)+IF(E424=6,0,Startup!$C$5)+IF(F424=8,0,Startup!$C$6)+IF(G424=10,0,Startup!$C$7)+IF(H424=12,0,Startup!$C$8)+IF(I424=14,0,Startup!$C$9)","v":137},"No"]
[42.3,1,2,4,7,8,10,12,15,{"$f":"IF(B425=0,0,Startup!$C$2)+IF(C425=2,0,Startup!$C$3)+IF(D425=4,0,Startup!$C$4)+IF(E425=6,0,Startup!$C$5)+IF(F425=8,0,Startup!$C$6)+IF(G425=10,0,Startup!$C$7)+IF(H425=12,0,Startup!$C$8)+IF(I425=14,0,Startup!$C$9)","v":137},"No"]
[42.4,1,2,4,7,8,10,12,15,{"$f":"IF(B426=0,0,Startup!$C$2)+IF(C426=2,0,Startup!$C$3)+IF(D426=4,0,Startup!$C$4)+IF(E426=6,0,Startup!$C$5)+IF(F426=8,0,Startup!$C$6)+IF(G426=10,0,Startup!$C$7)+IF(H426=12,0,Startup!$C$8)+IF(I426=14,0,Startup!$C$9)","v":137},"No"]
[42.5,1,2,4,7,8,10,12,15,{"$f":"IF(B427=0,0,Startup!$C$2)+IF(C427=2,0,Startup!$C$3)+IF(D427=4,0,Startup!$C$4)+IF(E427=6,0,Startup!$C$5)+IF(F427=8,0,Startup!$C$6)+IF(G427=10,0,Startup!$C$7)+IF(H427=12,0,Startup!$C$8)+IF(I427=14,0,Startup!$C$9)","v":137},"No"]
[42.6,1,2,4,7,8,10,12,15,{"$f":"IF(B428=0,0,Startup!$C$2)+IF(C428=2,0,Startup!$C$3)+IF(D428=4,0,Startup!$C$4)+IF(E428=6,0,Startup!$C$5)+IF(F428=8,0,Startup!$C$6)+IF(G428=10,0,Startup!$C$7)+IF(H428=12,0,Startup!$C$8)+IF(I428=14,0,Startup!$C$9)","v":137},"No"]
[42.7,1,2,4,7,8,10,12,15,{"$f":"IF(B429=0,0,Startup!$C$2)+IF(C429=2,0,Startup!$C$3)+IF(D429=4,0,Startup!$C$4)+IF(E429=6,0,Startup!$C$5)+IF(F429=8,0,Startup!$C$6)+IF(G429=10,0,Startup!$C$7)+IF(H429=12,0,Startup!$C$8)+IF(I429=14,0,Startup!$C$9)","v":137},"No"]
[42.8,1,2,4,7,8,10,12,15,{"$f":"IF(B430=0,0,Startup!$C$2)+IF(C430=2,0,Startup!$C$3)+IF(D430=4,0,Startup!$C$4)+IF(E430=6,0,Startup!$C$5)+IF(F430=8,0,Startup!$C$6)+IF(G430=10,0,Startup!$C$7)+IF(H430=12,0,Startup!$C$8)+IF(I430=14,0,Startup!$C$9)","v":137},"No"]
[42.9,1,2,4,7,8,10,12,15,{"$f":"IF(B431=0,0,Startup!$C$2)+IF(C431=2,0,Startup!$C$3)+IF(D431=4,0,Startup!$C$4)+IF(E431=6,0,Startup!$C$5)+IF(F431=8,0,Startup!$C$6)+IF(G431=10,0,Startup!$C$7)+IF(H431=12,0,Startup!$C$8)+IF(I431=14,0,Startup!$C$9)","v":137},"No"]
[43,1,2,4,7,8,10,12,15,{"$f":"IF(B432=0,0,Startup!$C$2)+IF(C432=2,0,Startup!$C$3)+IF(D432=4,0,Startup!$C$4)+IF(E432=6,0,Startup!$C$5)+IF(F432=8,0,Startup!$C$6)+IF(G432=10,0,Startup!$C$7)+IF(H432=12,0,Startup!$C$8)+IF(I432=14,0,Startup!$C$9)","v":137},"No"]
[43.1,1,2,4,7,8,10,12,15,{"$f":"IF(B433=0,0,Startup!$C$2)+IF(C433=2,0,Startup!$C$3)+IF(D433=4,0,Startup!$C$4)+IF(E433=6,0,Startup!$C$5)+IF(F433=8,0,Startup!$C$6)+IF(G433=10,0,Startup!$C$7)+IF(H433=12,0,Startup!$C$8)+IF(I433=14,0,Startup!$C$9)","v":137},"No"]
[43.2,1,2,4,7,8,10,12,15,{"$f":"IF(B434=0,0,Startup!$C$2)+IF(C434=2,0,Startup!$C$3)+IF(D434=4,0,Startup!$C$4)+IF(E434=6,0,Startup!$C$5)+IF(F434=8,0,Startup!$C$6)+IF(G434=10,0,Startup!$C$7)+IF(H434=12,0,Startup!$C$8)+IF(I434=14,0,Startup!$C$9)","v":137},"No"]
[43.3,1,2,4,7,8,10,12,15,{"$f":"IF(B435=0,0,Startup!$C$2)+IF(C435=2,0,Startup!$C$3)+IF(D435=4,0,Startup!$C$4)+IF(E435=6,0,Startup!$C$5)+IF(F435=8,0,Startup!$C$6)+IF(G435=10,0,Startup!$C$7)+IF(H435=12,0,Startup!$C$8)+IF(I435=14,0,Startup!$C$9)","v":137},"No"]
[43.4,1,2,4,7,8,10,12,15,{"$f":"IF(B436=0,0,Startup!$C$2)+IF(C436=2,0,Startup!$C$3)+IF(D436=4,0,Startup!$C$4)+IF(E436=6,0,Startup!$C$5)+IF(F436=8,0,Startup!$C$6)+IF(G436=10,0,Startup!$C$7)+IF(H436=12,0,Startup!$C$8)+IF(I436=14,0,Startup!$C$9)","v":137},"No"]
[43.5,1,2,4,7,8,10,12,15,{"$f":"IF(B437=0,0,Startup!$C$2)+IF(C437=2,0,Startup!$C$3)+IF(D437=4,0,Startup!$C$4)+IF(E437=6,0,Startup!$C$5)+IF(F437=8,0,Startup!$C$6)+IF(G437=10,0,Startup!$C$7)+IF(H437=12,0,Startup!$C$8)+IF(I437=14,0,Startup!$C$9)","v":137},"No"]
[43.6,1,2,4,7,8,10,12,15,{"$f":"IF(B438=0,0,Startup!$C$2)+IF(C438=2,0,Startup!$C$3)+IF(D438=4,0,Startup!$C$4)+IF(E438=6,0,Startup!$C$5)+IF(F438=8,0,Startup!$C$6)+IF(G438=10,0,Startup!$C$7)+IF(H438=12,0,Startup!$C$8)+IF(I438=14,0,Startup!$C$9)","v":137},"No"]
[43.7,1,2,4,7,8,10,12,15,{"$f":"IF(B439=0,0,Startup!$C$2)+IF(C439=2,0,Startup!$C$3)+IF(D439=4,0,Startup!$C$4)+IF(E439=6,0,Startup!$C$5)+IF(F439=8,0,Startup!$C$6)+IF(G439=10,0,Startup!$C$7)+IF(H439=12,0,Startup!$C$8)+IF(I439=14,0,Startup!$C$9)","v":137},"No"]
[43.8,1,2,4,7,8,10,12,15,{"$f":"IF(B440=0,0,Startup!$C$2)+IF(C440=2,0,Startup!$C$3)+IF(D440=4,0,Startup!$C$4)+IF(E440=6,0,Startup!$C$5)+IF(F440=8,0,Startup!$C$6)+IF(G440=10,0,Startup!$C$7)+IF(H440=12,0,Startup!$C$8)+IF(I440=14,0,Startup!$C$9)","v":137},"No"]
[43.9,1,2,4,7,8,10,12,15,{"$f":"IF(B441=0,0,Startup!$C$2)+IF(C441=2,0,Startup!$C$3)+IF(D441=4,0,Startup!$C$4)+IF(E441=6,0,Startup!$C$5)+IF(F441=8,0,Startup!$C$6)+IF(G441=10,0,Startup!$C$7)+IF(H441=12,0,Startup!$C$8)+IF(I441=14,0,Startup!$C$9)","v":137},"No"]
[44,1,2,4,7,8,10,12,15,{"$f":"IF(B442=0,0,Startup!$C$2)+IF(C442=2,0,Startup!$C$3)+IF(D442=4,0,Startup!$C$4)+IF(E442=6,0,Startup!$C$5)+IF(F442=8,0,Startup!$C$6)+IF(G442=10,0,Startup!$C$7)+IF(H442=12,0,Startup!$C$8)+IF(I442=14,0,Startup!$C$9)","v":137},"No"]
[44.1,1,2,4,7,8,10,12,15,{"$f":"IF(B443=0,0,Startup!$C$2)+IF(C443=2,0,Startup!$C$3)+IF(D443=4,0,Startup!$C$4)+IF(E443=6,0,Startup!$C$5)+IF(F443=8,0,Startup!$C$6)+IF(G443=10,0,Startup!$C$7)+IF(H443=12,0,Startup!$C$8)+IF(I443=14,0,Startup!$C$9)","v":137},"No"]
[44.2,1,2,4,7,8,10,12,15,{"$f":"IF(B444=0,0,Startup!$C$2)+IF(C444=2,0,Startup!$C$3)+IF(D444=4,0,Startup!$C$4)+IF(E444=6,0,Startup!$C$5)+IF(F444=8,0,Startup!$C$6)+IF(G444=10,0,Startup!$C$7)+IF(H444=12,0,Startup!$C$8)+IF(I444=14,0,Startup!$C$9)","v":137},"No"]
[44.3,1,2,4,7,8,10,12,15,{"$f":"IF(B445=0,0,Startup!$C$2)+IF(C445=2,0,Startup!$C$3)+IF(D445=4,0,Startup!$C$4)+IF(E445=6,0,Startup!$C$5)+IF(F445=8,0,Startup!$C$6)+IF(G445=10,0,Startup!$C$7)+IF(H445=12,0,Startup!$C$8)+IF(I445=14,0,Startup!$C$9)","v":137},"No"]
[44.4,1,2,4,7,8,10,12,15,{"$f":"IF(B446=0,0,Startup!$C$2)+IF(C446=2,0,Startup!$C$3)+IF(D446=4,0,Startup!$C$4)+IF(E446=6,0,Startup!$C$5)+IF(F446=8,0,Startup!$C$6)+IF(G446=10,0,Startup!$C$7)+IF(H446=12,0,Startup!$C$8)+IF(I446=14,0,Startup!$C$9)","v":137},"No"]
[44.5,1,2,4,7,8,10,12,15,{"$f":"IF(B447=0,0,Startup!$C$2)+IF(C447=2,0,Startup!$C$3)+IF(D447=4,0,Startup!$C$4)+IF(E447=6,0,Startup!$C$5)+IF(F447=8,0,Startup!$C$6)+IF(G447=10,0,Startup!$C$7)+IF(H447=12,0,Startup!$C$8)+IF(I447=14,0,Startup!$C$9)","v":137},"No"]
[44.6,1,2,4,7,8,10,12,15,{"$f":"IF(B448=0,0,Startup!$C$2)+IF(C448=2,0,Startup!$C$3)+IF(D448=4,0,Startup!$C$4)+IF(E448=6,0,Startup!$C$5)+IF(F448=8,0,Startup!$C$6)+IF(G448=10,0,Startup!$C$7)+IF(H448=12,0,Startup!$C$8)+IF(I448=14,0,Startup!$C$9)","v":137},"No"]
[44.7,1,2,4,7,8,10,12,15,{"$f":"IF(B449=0,0,Startup!$C$2)+IF(C449=2,0,Startup!$C$3)+IF(D449=4,0,Startup!$C$4)+IF(E449=6,0,Startup!$C$5)+IF(F449=8,0,Startup!$C$6)+IF(G449=10,0,Startup!$C$7)+IF(H449=12,0,Startup!$C$8)+IF(I449=14,0,Startup!$C$9)","v":137},"No"]
[44.8,1,2,4,7,8,10,12,15,{"$f":"IF(B450=0,0,Startup!$C$2)+IF(C450=2,0,Startup!$C$3)+IF(D450=4,0,Startup!$C$4)+IF(E450=6,0,Startup!$C$5)+IF(F450=8,0,Startup!$C$6)+IF(G450=10,0,Startup!$C$7)+IF(H450=12,0,Startup!$C$8)+IF(I450=14,0,Startup!$C$9)","v":137},"No"]
[44.9,1,2,4,7,8,10,12,15,{"$f":"IF(B451=0,0,Startup!$C$2)+IF(C451=2,0,Startup!$C$3)+IF(D451=4,0,Startup!$C$4)+IF(E451=6,0,Startup!$C$5)+IF(F451=8,0,Startup!$C$6)+IF(G451=10,0,Startup!$C$7)+IF(H451=12,0,Startup!$C$8)+IF(I451=14,0,Startup!$C$9)","v":137},"No"]
[45,1,2,4,7,8,10,12,15,{"$f":"IF(B452=0,0,Startup!$C$2)+IF(C452=2,0,Startup!$C$3)+IF(D452=4,0,Startup!$C$4)+IF(E452=6,0,Startup!$C$5)+IF(F452=8,0,Startup!$C$6)+IF(G452=10,0,Startup!$C$7)+IF(H452=12,0,Startup!$C$8)+IF(I452=14,0,Startup!$C$9)","v":137},{"$f":"IF(J452<>J451,\"Yes\",\"No\")","v":"No"}]
[45.1,1,2,4,7,8,10,12,15,{"$f":"IF(B453=0,0,Startup!$C$2)+IF(C453=2,0,Startup!$C$3)+IF(D453=4,0,Startup!$C$4)+IF(E453=6,0,Startup!$C$5)+IF(F453=8,0,Startup!$C$6)+IF(G453=10,0,Startup!$C$7)+IF(H453=12,0,Startup!$C$8)+IF(I453=14,0,Startup!$C$9)","v":137},"No"]
[45.2,1,2,4,7,8,10,12,15,{"$f":"IF(B454=0,0,Startup!$C$2)+IF(C454=2,0,Startup!$C$3)+IF(D454=4,0,Startup!$C$4)+IF(E454=6,0,Startup!$C$5)+IF(F454=8,0,Startup!$C$6)+IF(G454=10,0,Startup!$C$7)+IF(H454=12,0,Startup!$C$8)+IF(I454=14,0,Startup!$C$9)","v":137},"No"]
[45.3,1,2,4,7,8,10,12,15,{"$f":"IF(B455=0,0,Startup!$C$2)+IF(C455=2,0,Startup!$C$3)+IF(D455=4,0,Startup!$C$4)+IF(E455=6,0,Startup!$C$5)+IF(F455=8,0,Startup!$C$6)+IF(G455=10,0,Startup!$C$7)+IF(H455=12,0,Startup!$C$8)+IF(I455=14,0,Startup!$C$9)","v":137},"No"]
[45.4,1,2,4,7,8,10,12,15,{"$f":"IF(B456=0,0,Startup!$C$2)+IF(C456=2,0,Startup!$C$3)+IF(D456=4,0,Startup!$C$4)+IF(E456=6,0,Startup!$C$5)+IF(F456=8,0,Startup!$C$6)+IF(G456=10,0,Startup!$C$7)+IF(H456=12,0,Startup!$C$8)+IF(I456=14,0,Startup!$C$9)","v":137},"No"]
[45.5,1,2,4,7,8,10,12,15,{"$f":"IF(B457=0,0,Startup!$C$2)+IF(C457=2,0,Startup!$C$3)+IF(D457=4,0,Startup!$C$4)+IF(E457=6,0,Startup!$C$5)+IF(F457=8,0,Startup!$C$6)+IF(G457=10,0,Startup!$C$7)+IF(H457=12,0,Startup!$C$8)+IF(I457=14,0,Startup!$C$9)","v":137},"No"]
[45.6,1,2,4,7,8,10,12,15,{"$f":"IF(B458=0,0,Startup!$C$2)+IF(C458=2,0,Startup!$C$3)+IF(D458=4,0,Startup!$C$4)+IF(E458=6,0,Startup!$C$5)+IF(F458=8,0,Startup!$C$6)+IF(G458=10,0,Startup!$C$7)+IF(H458=12,0,Startup!$C$8)+IF(I458=14,0,Startup!$C$9)","v":137},"No"]
[45.7,1,2,4,7,8,10,12,15,{"$f":"IF(B459=0,0,Startup!$C$2)+IF(C459=2,0,Startup!$C$3)+IF(D459=4,0,Startup!$C$4)+IF(E459=6,0,Startup!$C$5)+IF(F459=8,0,Startup!$C$6)+IF(G459=10,0,Startup!$C$7)+IF(H459=12,0,Startup!$C$8)+IF(I459=14,0,Startup!$C$9)","v":137},"No"]
[45.8,1,2,4,7,8,10,12,15,{"$f":"IF(B460=0,0,Startup!$C$2)+IF(C460=2,0,Startup!$C$3)+IF(D460=4,0,Startup!$C$4)+IF(E460=6,0,Startup!$C$5)+IF(F460=8,0,Startup!$C$6)+IF(G460=10,0,Startup!$C$7)+IF(H460=12,0,Startup!$C$8)+IF(I460=14,0,Startup!$C$9)","v":137},"No"]
[45.9,1,2,4,7,8,10,12,15,{"$f":"IF(B461=0,0,Startup!$C$2)+IF(C461=2,0,Startup!$C$3)+IF(D461=4,0,Startup!$C$4)+IF(E461=6,0,Startup!$C$5)+IF(F461=8,0,Startup!$C$6)+IF(G461=10,0,Startup!$C$7)+IF(H461=12,0,Startup!$C$8)+IF(I461=14,0,Startup!$C$9)","v":137},"No"]
[46,1,2,4,7,8,10,12,15,{"$f":"IF(B462=0,0,Startup!$C$2)+IF(C462=2,0,Startup!$C$3)+IF(D462=4,0,Startup!$C$4)+IF(E462=6,0,Startup!$C$5)+IF(F462=8,0,Startup!$C$6)+IF(G462=10,0,Startup!$C$7)+IF(H462=12,0,Startup!$C$8)+IF(I462=14,0,Startup!$C$9)","v":137},"No"]
[46.1,1,2,4,7,8,10,12,15,{"$f":"IF(B463=0,0,Startup!$C$2)+IF(C463=2,0,Startup!$C$3)+IF(D463=4,0,Startup!$C$4)+IF(E463=6,0,Startup!$C$5)+IF(F463=8,0,Startup!$C$6)+IF(G463=10,0,Startup!$C$7)+IF(H463=12,0,Startup!$C$8)+IF(I463=14,0,Startup!$C$9)","v":137},"No"]
[46.2,1,2,4,7,8,10,12,15,{"$f":"IF(B464=0,0,Startup!$C$2)+IF(C464=2,0,Startup!$C$3)+IF(D464=4,0,Startup!$C$4)+IF(E464=6,0,Startup!$C$5)+IF(F464=8,0,Startup!$C$6)+IF(G464=10,0,Startup!$C$7)+IF(H464=12,0,Startup!$C$8)+IF(I464=14,0,Startup!$C$9)","v":137},"No"]
[46.3,1,2,4,7,8,10,12,15,{"$f":"IF(B465=0,0,Startup!$C$2)+IF(C465=2,0,Startup!$C$3)+IF(D465=4,0,Startup!$C$4)+IF(E465=6,0,Startup!$C$5)+IF(F465=8,0,Startup!$C$6)+IF(G465=10,0,Startup!$C$7)+IF(H465=12,0,Startup!$C$8)+IF(I465=14,0,Startup!$C$9)","v":137},"No"]
[46.4,1,2,4,7,8,10,12,15,{"$f":"IF(B466=0,0,Startup!$C$2)+IF(C466=2,0,Startup!$C$3)+IF(D466=4,0,Startup!$C$4)+IF(E466=6,0,Startup!$C$5)+IF(F466=8,0,Startup!$C$6)+IF(G466=10,0,Startup!$C$7)+IF(H466=12,0,Startup!$C$8)+IF(I466=14,0,Startup!$C$9)","v":137},"No"]
[46.5,1,2,4,7,8,10,12,15,{"$f":"IF(B467=0,0,Startup!$C$2)+IF(C467=2,0,Startup!$C$3)+IF(D467=4,0,Startup!$C$4)+IF(E467=6,0,Startup!$C$5)+IF(F467=8,0,Startup!$C$6)+IF(G467=10,0,Startup!$C$7)+IF(H467=12,0,Startup!$C$8)+IF(I467=14,0,Startup!$C$9)","v":137},"No"]
[46.6,1,2,4,7,8,10,12,15,{"$f":"IF(B468=0,0,Startup!$C$2)+IF(C468=2,0,Startup!$C$3)+IF(D468=4,0,Startup!$C$4)+IF(E468=6,0,Startup!$C$5)+IF(F468=8,0,Startup!$C$6)+IF(G468=10,0,Startup!$C$7)+IF(H468=12,0,Startup!$C$8)+IF(I468=14,0,Startup!$C$9)","v":137},"No"]
[46.7,1,2,4,7,8,10,12,15,{"$f":"IF(B469=0,0,Startup!$C$2)+IF(C469=2,0,Startup!$C$3)+IF(D469=4,0,Startup!$C$4)+IF(E469=6,0,Startup!$C$5)+IF(F469=8,0,Startup!$C$6)+IF(G469=10,0,Startup!$C$7)+IF(H469=12,0,Startup!$C$8)+IF(I469=14,0,Startup!$C$9)","v":137},"No"]
[46.8,1,2,4,7,8,10,12,15,{"$f":"IF(B470=0,0,Startup!$C$2)+IF(C470=2,0,Startup!$C$3)+IF(D470=4,0,Startup!$C$4)+IF(E470=6,0,Startup!$C$5)+IF(F470=8,0,Startup!$C$6)+IF(G470=10,0,Startup!$C$7)+IF(H470=12,0,Startup!$C$8)+IF(I470=14,0,Startup!$C$9)","v":137},"No"]
[46.9,1,2,4,7,8,10,12,15,{"$f":"IF(B471=0,0,Startup!$C$2)+IF(C471=2,0,Startup!$C$3)+IF(D471=4,0,Startup!$C$4)+IF(E471=6,0,Startup!$C$5)+IF(F471=8,0,Startup!$C$6)+IF(G471=10,0,Startup!$C$7)+IF(H471=12,0,Startup!$C$8)+IF(I471=14,0,Startup!$C$9)","v":137},"No"]
[47,1,2,4,7,8,10,12,15,{"$f":"IF(B472=0,0,Startup!$C$2)+IF(C472=2,0,Startup!$C$3)+IF(D472=4,0,Startup!$C$4)+IF(E472=6,0,Startup!$C$5)+IF(F472=8,0,Startup!$C$6)+IF(G472=10,0,Startup!$C$7)+IF(H472=12,0,Startup!$C$8)+IF(I472=14,0,Startup!$C$9)","v":137},"No"]
[47.1,1,2,4,7,8,10,12,15,{"$f":"IF(B473=0,0,Startup!$C$2)+IF(C473=2,0,Startup!$C$3)+IF(D473=4,0,Startup!$C$4)+IF(E473=6,0,Startup!$C$5)+IF(F473=8,0,Startup!$C$6)+IF(G473=10,0,Startup!$C$7)+IF(H473=12,0,Startup!$C$8)+IF(I473=14,0,Startup!$C$9)","v":137},"No"]
[47.2,1,2,4,7,8,10,12,15,{"$f":"IF(B474=0,0,Startup!$C$2)+IF(C474=2,0,Startup!$C$3)+IF(D474=4,0,Startup!$C$4)+IF(E474=6,0,Startup!$C$5)+IF(F474=8,0,Startup!$C$6)+IF(G474=10,0,Startup!$C$7)+IF(H474=12,0,Startup!$C$8)+IF(I474=14,0,Startup!$C$9)","v":137},"No"]
[47.3,1,2,4,7,8,10,12,15,{"$f":"IF(B475=0,0,Startup!$C$2)+IF(C475=2,0,Startup!$C$3)+IF(D475=4,0,Startup!$C$4)+IF(E475=6,0,Startup!$C$5)+IF(F475=8,0,Startup!$C$6)+IF(G475=10,0,Startup!$C$7)+IF(H475=12,0,Startup!$C$8)+IF(I475=14,0,Startup!$C$9)","v":137},"No"]
[47.4,1,2,4,7,8,10,12,15,{"$f":"IF(B476=0,0,Startup!$C$2)+IF(C476=2,0,Startup!$C$3)+IF(D476=4,0,Startup!$C$4)+IF(E476=6,0,Startup!$C$5)+IF(F476=8,0,Startup!$C$6)+IF(G476=10,0,Startup!$C$7)+IF(H476=12,0,Startup!$C$8)+IF(I476=14,0,Startup!$C$9)","v":137},"No"]
[47.5,1,2,4,7,8,10,12,15,{"$f":"IF(B477=0,0,Startup!$C$2)+IF(C477=2,0,Startup!$C$3)+IF(D477=4,0,Startup!$C$4)+IF(E477=6,0,Startup!$C$5)+IF(F477=8,0,Startup!$C$6)+IF(G477=10,0,Startup!$C$7)+IF(H477=12,0,Startup!$C$8)+IF(I477=14,0,Startup!$C$9)","v":137},"No"]
[47.6,1,2,4,7,8,10,12,15,{"$f":"IF(B478=0,0,Startup!$C$2)+IF(C478=2,0,Startup!$C$3)+IF(D478=4,0,Startup!$C$4)+IF(E478=6,0,Startup!$C$5)+IF(F478=8,0,Startup!$C$6)+IF(G478=10,0,Startup!$C$7)+IF(H478=12,0,Startup!$C$8)+IF(I478=14,0,Startup!$C$9)","v":137},"No"]
[47.7,1,2,4,7,8,10,12,15,{"$f":"IF(B479=0,0,Startup!$C$2)+IF(C479=2,0,Startup!$C$3)+IF(D479=4,0,Startup!$C$4)+IF(E479=6,0,Startup!$C$5)+IF(F479=8,0,Startup!$C$6)+IF(G479=10,0,Startup!$C$7)+IF(H479=12,0,Startup!$C$8)+IF(I479=14,0,Startup!$C$9)","v":137},"No"]
[47.8,1,2,4,7,8,10,12,15,{"$f":"IF(B480=0,0,Startup!$C$2)+IF(C480=2,0,Startup!$C$3)+IF(D480=4,0,Startup!$C$4)+IF(E480=6,0,Startup!$C$5)+IF(F480=8,0,Startup!$C$6)+IF(G480=10,0,Startup!$C$7)+IF(H480=12,0,Startup!$C$8)+IF(I480=14,0,Startup!$C$9)","v":137},"No"]
[47.9,1,2,4,7,8,10,12,15,{"$f":"IF(B481=0,0,Startup!$C$2)+IF(C481=2,0,Startup!$C$3)+IF(D481=4,0,Startup!$C$4)+IF(E481=6,0,Startup!$C$5)+IF(F481=8,0,Startup!$C$6)+IF(G481=10,0,Startup!$C$7)+IF(H481=12,0,Startup!$C$8)+IF(I481=14,0,Startup!$C$9)","v":137},"No"]
[48,1,2,4,7,8,10,12,15,{"$f":"IF(B482=0,0,Startup!$C$2)+IF(C482=2,0,Startup!$C$3)+IF(D482=4,0,Startup!$C$4)+IF(E482=6,0,Startup!$C$5)+IF(F482=8,0,Startup!$C$6)+IF(G482=10,0,Startup!$C$7)+IF(H482=12,0,Startup!$C$8)+IF(I482=14,0,Startup!$C$9)","v":137},"No"]
[48.1,1,2,4,7,8,10,12,15,{"$f":"IF(B483=0,0,Startup!$C$2)+IF(C483=2,0,Startup!$C$3)+IF(D483=4,0,Startup!$C$4)+IF(E483=6,0,Startup!$C$5)+IF(F483=8,0,Startup!$C$6)+IF(G483=10,0,Startup!$C$7)+IF(H483=12,0,Startup!$C$8)+IF(I483=14,0,Startup!$C$9)","v":137},"No"]
[48.2,1,2,4,7,8,10,12,15,{"$f":"IF(B484=0,0,Startup!$C$2)+IF(C484=2,0,Startup!$C$3)+IF(D484=4,0,Startup!$C$4)+IF(E484=6,0,Startup!$C$5)+IF(F484=8,0,Startup!$C$6)+IF(G484=10,0,Startup!$C$7)+IF(H484=12,0,Startup!$C$8)+IF(I484=14,0,Startup!$C$9)","v":137},"No"]
[48.3,1,2,4,7,8,10,12,15,{"$f":"IF(B485=0,0,Startup!$C$2)+IF(C485=2,0,Startup!$C$3)+IF(D485=4,0,Startup!$C$4)+IF(E485=6,0,Startup!$C$5)+IF(F485=8,0,Startup!$C$6)+IF(G485=10,0,Startup!$C$7)+IF(H485=12,0,Startup!$C$8)+IF(I485=14,0,Startup!$C$9)","v":137},"No"]
[48.4,1,2,4,7,8,10,12,15,{"$f":"IF(B486=0,0,Startup!$C$2)+IF(C486=2,0,Startup!$C$3)+IF(D486=4,0,Startup!$C$4)+IF(E486=6,0,Startup!$C$5)+IF(F486=8,0,Startup!$C$6)+IF(G486=10,0,Startup!$C$7)+IF(H486=12,0,Startup!$C$8)+IF(I486=14,0,Startup!$C$9)","v":137},"No"]
[48.5,1,2,4,7,8,10,12,15,{"$f":"IF(B487=0,0,Startup!$C$2)+IF(C487=2,0,Startup!$C$3)+IF(D487=4,0,Startup!$C$4)+IF(E487=6,0,Startup!$C$5)+IF(F487=8,0,Startup!$C$6)+IF(G487=10,0,Startup!$C$7)+IF(H487=12,0,Startup!$C$8)+IF(I487=14,0,Startup!$C$9)","v":137},"No"]
[48.6,1,2,4,7,8,10,12,15,{"$f":"IF(B488=0,0,Startup!$C$2)+IF(C488=2,0,Startup!$C$3)+IF(D488=4,0,Startup!$C$4)+IF(E488=6,0,Startup!$C$5)+IF(F488=8,0,Startup!$C$6)+IF(G488=10,0,Startup!$C$7)+IF(H488=12,0,Startup!$C$8)+IF(I488=14,0,Startup!$C$9)","v":137},"No"]
[48.7,1,2,4,7,8,10,12,15,{"$f":"IF(B489=0,0,Startup!$C$2)+IF(C489=2,0,Startup!$C$3)+IF(D489=4,0,Startup!$C$4)+IF(E489=6,0,Startup!$C$5)+IF(F489=8,0,Startup!$C$6)+IF(G489=10,0,Startup!$C$7)+IF(H489=12,0,Startup!$C$8)+IF(I489=14,0,Startup!$C$9)","v":137},"No"]
[48.8,1,2,4,7,8,10,12,15,{"$f":"IF(B490=0,0,Startup!$C$2)+IF(C490=2,0,Startup!$C$3)+IF(D490=4,0,Startup!$C$4)+IF(E490=6,0,Startup!$C$5)+IF(F490=8,0,Startup!$C$6)+IF(G490=10,0,Startup!$C$7)+IF(H490=12,0,Startup!$C$8)+IF(I490=14,0,Startup!$C$9)","v":137},"No"]
[48.9,1,2,4,7,8,10,12,15,{"$f":"IF(B491=0,0,Startup!$C$2)+IF(C491=2,0,Startup!$C$3)+IF(D491=4,0,Startup!$C$4)+IF(E491=6,0,Startup!$C$5)+IF(F491=8,0,Startup!$C$6)+IF(G491=10,0,Startup!$C$7)+IF(H491=12,0,Startup!$C$8)+IF(I491=14,0,Startup!$C$9)","v":137},"No"]
[49,1,2,4,7,8,10,12,15,{"$f":"IF(B492=0,0,Startup!$C$2)+IF(C492=2,0,Startup!$C$3)+IF(D492=4,0,Startup!$C$4)+IF(E492=6,0,Startup!$C$5)+IF(F492=8,0,Startup!$C$6)+IF(G492=10,0,Startup!$C$7)+IF(H492=12,0,Startup!$C$8)+IF(I492=14,0,Startup!$C$9)","v":137},"No"]
[49.1,1,2,4,7,8,10,12,15,{"$f":"IF(B493=0,0,Startup!$C$2)+IF(C493=2,0,Startup!$C$3)+IF(D493=4,0,Startup!$C$4)+IF(E493=6,0,Startup!$C$5)+IF(F493=8,0,Startup!$C$6)+IF(G493=10,0,Startup!$C$7)+IF(H493=12,0,Startup!$C$8)+IF(I493=14,0,Startup!$C$9)","v":137},"No"]
[49.2,1,2,4,7,8,10,12,15,{"$f":"IF(B494=0,0,Startup!$C$2)+IF(C494=2,0,Startup!$C$3)+IF(D494=4,0,Startup!$C$4)+IF(E494=6,0,Startup!$C$5)+IF(F494=8,0,Startup!$C$6)+IF(G494=10,0,Startup!$C$7)+IF(H494=12,0,Startup!$C$8)+IF(I494=14,0,Startup!$C$9)","v":137},"No"]
[49.3,1,2,4,7,8,10,12,15,{"$f":"IF(B495=0,0,Startup!$C$2)+IF(C495=2,0,Startup!$C$3)+IF(D495=4,0,Startup!$C$4)+IF(E495=6,0,Startup!$C$5)+IF(F495=8,0,Startup!$C$6)+IF(G495=10,0,Startup!$C$7)+IF(H495=12,0,Startup!$C$8)+IF(I495=14,0,Startup!$C$9)","v":137},"No"]
[49.4,1,2,4,7,8,10,12,15,{"$f":"IF(B496=0,0,Startup!$C$2)+IF(C496=2,0,Startup!$C$3)+IF(D496=4,0,Startup!$C$4)+IF(E496=6,0,Startup!$C$5)+IF(F496=8,0,Startup!$C$6)+IF(G496=10,0,Startup!$C$7)+IF(H496=12,0,Startup!$C$8)+IF(I496=14,0,Startup!$C$9)","v":137},"No"]
[49.5,1,2,4,7,8,10,12,15,{"$f":"IF(B497=0,0,Startup!$C$2)+IF(C497=2,0,Startup!$C$3)+IF(D497=4,0,Startup!$C$4)+IF(E497=6,0,Startup!$C$5)+IF(F497=8,0,Startup!$C$6)+IF(G497=10,0,Startup!$C$7)+IF(H497=12,0,Startup!$C$8)+IF(I497=14,0,Startup!$C$9)","v":137},"No"]
[49.6,1,2,4,7,8,10,12,15,{"$f":"IF(B498=0,0,Startup!$C$2)+IF(C498=2,0,Startup!$C$3)+IF(D498=4,0,Startup!$C$4)+IF(E498=6,0,Startup!$C$5)+IF(F498=8,0,Startup!$C$6)+IF(G498=10,0,Startup!$C$7)+IF(H498=12,0,Startup!$C$8)+IF(I498=14,0,Startup!$C$9)","v":137},"No"]
[49.7,1,2,4,7,8,10,12,15,{"$f":"IF(B499=0,0,Startup!$C$2)+IF(C499=2,0,Startup!$C$3)+IF(D499=4,0,Startup!$C$4)+IF(E499=6,0,Startup!$C$5)+IF(F499=8,0,Startup!$C$6)+IF(G499=10,0,Startup!$C$7)+IF(H499=12,0,Startup!$C$8)+IF(I499=14,0,Startup!$C$9)","v":137},"No"]
[49.8,1,2,4,7,8,10,12,15,{"$f":"IF(B500=0,0,Startup!$C$2)+IF(C500=2,0,Startup!$C$3)+IF(D500=4,0,Startup!$C$4)+IF(E500=6,0,Startup!$C$5)+IF(F500=8,0,Startup!$C$6)+IF(G500=10,0,Startup!$C$7)+IF(H500=12,0,Startup!$C$8)+IF(I500=14,0,Startup!$C$9)","v":137},"No"]
[49.9,1,2,4,7,8,10,12,15,{"$f":"IF(B501=0,0,Startup!$C$2)+IF(C501=2,0,Startup!$C$3)+IF(D501=4,0,Startup!$C$4)+IF(E501=6,0,Startup!$C$5)+IF(F501=8,0,Startup!$C$6)+IF(G501=10,0,Startup!$C$7)+IF(H501=12,0,Startup!$C$8)+IF(I501=14,0,Startup!$C$9)","v":137},"No"]

{"sheet":"Shutdown","index":2,"n_rows":9,"n_cols":25,"rows_kept":9,"cut":false,"hidden":false,"merged":[]}
[null,"Output name","Binary","Time0","State0","Time1","Change1","Time2","Change2","Time3","Change3","Time4","Change4","Time5","Change5","Time6","Change6","Time7","Change7","Time8","Change8","Time9","Change9","Time10","Change10"]
[null,{"$f":"Startup!B2","v":"Hold 12V"},1,0,{"$f":"Startup!Z2","v":"On"},21,{"$f":"IF(F2=\"\",\"\",IF(E2=\"Off\",\"On\",\"Off\"))","v":"Off"},null,{"$f":"IF(H2=\"\",\"\",IF(G2=\"Off\",\"On\",\"Off\"))","v":""},null,{"$f":"IF(J2=\"\",\"\",IF(I2=\"Off\",\"On\",\"Off\"))","v":""},null,{"$f":"IF(L2=\"\",\"\",IF(K2=\"Off\",\"On\",\"Off\"))","v":""},null,{"$f":"IF(N2=\"\",\"\",IF(M2=\"Off\",\"On\",\"Off\"))","v":""},null,{"$f":"IF(P2=\"\",\"\",IF(O2=\"Off\",\"On\",\"Off\"))","v":""},null,{"$f":"IF(R2=\"\",\"\",IF(Q2=\"Off\",\"On\",\"Off\"))","v":""},null,{"$f":"IF(T2=\"\",\"\",IF(S2=\"Off\",\"On\",\"Off\"))","v":""},null,{"$f":"IF(V2=\"\",\"\",IF(U2=\"Off\",\"On\",\"Off\"))","v":""},null,{"$f":"IF(X2=\"\",\"\",IF(W2=\"Off\",\"On\",\"Off\"))","v":""}]
[null,{"$f":"Startup!B3","v":"Motor open"},2,0,{"$f":"Startup!Z3","v":"Off"},null,{"$f":"IF(F3=\"\",\"\",IF(E3=\"Off\",\"On\",\"Off\"))","v":""},null,{"$f":"IF(H3=\"\",\"\",IF(G3=\"Off\",\"On\",\"Off\"))","v":""},null,{"$f":"IF(J3=\"\",\"\",IF(I3=\"Off\",\"On\",\"Off\"))","v":""},null,{"$f":"IF(L3=\"\",\"\",IF(K3=\"Off\",\"On\",\"Off\"))","v":""},null,{"$f":"IF(N3=\"\",\"\",IF(M3=\"Off\",\"On\",\"Off\"))","v":""},null,{"$f":"IF(P3=\"\",\"\",IF(O3=\"Off\",\"On\",\"Off\"))","v":""},null,{"$f":"IF(R3=\"\",\"\",IF(Q3=\"Off\",\"On\",\"Off\"))","v":""},null,{"$f":"IF(T3=\"\",\"\",IF(S3=\"Off\",\"On\",\"Off\"))","v":""},null,{"$f":"IF(V3=\"\",\"\",IF(U3=\"Off\",\"On\",\"Off\"))","v":""},null,{"$f":"IF(X3=\"\",\"\",IF(W3=\"Off\",\"On\",\"Off\"))","v":""}]
[null,{"$f":"Startup!B4","v":"Motor close"},4,0,{"$f":"Startup!Z4","v":"Off"},1,"On",20,"Off",null,"",null,"",null,"",null,"",null,"",null,"",null,"",null,""]
[null,{"$f":"Startup!B5","v":"Router power"},8,0,{"$f":"Startup!Z5","v":"On"},8,"Off",null,"",null,"",null,"",null,"",null,"",null,"",null,"",null,"",null,""]
[null,{"$f":"Startup!B6","v":"Router button"},16,0,{"$f":"Startup!Z6","v":"Off"},2,"On",5,"Off",null,"",null,"",null,"",null,"",null,"",null,"",null,"",null,""]
[null,{"$f":"Startup!B7","v":"PLAY button"},32,0,{"$f":"Startup!Z7","v":"Off"},null,"",null,"",null,"",null,"",null,"",null,"",null,"",null,"",null,"",null,""]
[null,{"$f":"Startup!B8","v":"REC button"},64,0,{"$f":"Startup!Z8","v":"Off"},null,"",null,"",null,"",null,"",null,"",null,"",null,"",null,"",null,"",null,""]
[null,{"$f":"Startup!B9","v":"Tablet power"},128,0,{"$f":"Startup!Z9","v":"On"},0.5,"Off",null,"",null,"",null,"",null,"",null,"",null,"",null,"",null,"",null,""]

{"sheet":"Shutdown_data","index":3,"n_rows":501,"n_cols":11,"rows_kept":501,"cut":false,"hidden":false,"merged":[]}
["Timestamp",{"$f":"Startup!B2","v":"Hold 12V"},{"$f":"Startup!B3","v":"Motor open"},{"$f":"Startup!B4","v":"Motor close"},{"$f":"Startup!B5","v":"Router power"},{"$f":"Startup!B6","v":"Router button"},{"$f":"Startup!B7","v":"PLAY button"},{"$f":"Startup!B8","v":"REC button"},{"$f":"Startup!B9","v":"Tablet power"},"Binary","Change"]
[0,1,2,4,7,8,10,12,15,{"$f":"IF(B2=0,0,Startup!$C$2)+IF(C2=2,0,Startup!$C$3)+IF(D2=4,0,Startup!$C$4)+IF(E2=6,0,Startup!$C$5)+IF(F2=8,0,Startup!$C$6)+IF(G2=10,0,Startup!$C$7)+IF(H2=12,0,Startup!$C$8)+IF(I2=14,0,Startup!$C$9)","v":137},{"$f":"IF(J2<>J1,\"Yes\",\"No\")","v":"Yes"}]
[0.1,1,2,4,7,8,10,12,15,{"$f":"IF(B3=0,0,Startup!$C$2)+IF(C3=2,0,Startup!$C$3)+IF(D3=4,0,Startup!$C$4)+IF(E3=6,0,Startup!$C$5)+IF(F3=8,0,Startup!$C$6)+IF(G3=10,0,Startup!$C$7)+IF(H3=12,0,Startup!$C$8)+IF(I3=14,0,Startup!$C$9)","v":137},{"$f":"IF(J3<>J2,\"Yes\",\"No\")","v":"No"}]
[0.2,1,2,4,7,8,10,12,15,{"$f":"IF(B4=0,0,Startup!$C$2)+IF(C4=2,0,Startup!$C$3)+IF(D4=4,0,Startup!$C$4)+IF(E4=6,0,Startup!$C$5)+IF(F4=8,0,Startup!$C$6)+IF(G4=10,0,Startup!$C$7)+IF(H4=12,0,Startup!$C$8)+IF(I4=14,0,Startup!$C$9)","v":137},{"$f":"IF(J4<>J3,\"Yes\",\"No\")","v":"No"}]
[0.3,1,2,4,7,8,10,12,15,{"$f":"IF(B5=0,0,Startup!$C$2)+IF(C5=2,0,Startup!$C$3)+IF(D5=4,0,Startup!$C$4)+IF(E5=6,0,Startup!$C$5)+IF(F5=8,0,Startup!$C$6)+IF(G5=10,0,Startup!$C$7)+IF(H5=12,0,Startup!$C$8)+IF(I5=14,0,Startup!$C$9)","v":137},"No"]
[0.4,1,2,4,7,8,10,12,15,{"$f":"IF(B6=0,0,Startup!$C$2)+IF(C6=2,0,Startup!$C$3)+IF(D6=4,0,Startup!$C$4)+IF(E6=6,0,Startup!$C$5)+IF(F6=8,0,Startup!$C$6)+IF(G6=10,0,Startup!$C$7)+IF(H6=12,0,Startup!$C$8)+IF(I6=14,0,Startup!$C$9)","v":137},"No"]
[0.5,1,2,4,7,8,10,12,14,{"$f":"IF(B7=0,0,Startup!$C$2)+IF(C7=2,0,Startup!$C$3)+IF(D7=4,0,Startup!$C$4)+IF(E7=6,0,Startup!$C$5)+IF(F7=8,0,Startup!$C$6)+IF(G7=10,0,Startup!$C$7)+IF(H7=12,0,Startup!$C$8)+IF(I7=14,0,Startup!$C$9)","v":9},"Yes"]
[0.6,1,2,4,7,8,10,12,14,{"$f":"IF(B8=0,0,Startup!$C$2)+IF(C8=2,0,Startup!$C$3)+IF(D8=4,0,Startup!$C$4)+IF(E8=6,0,Startup!$C$5)+IF(F8=8,0,Startup!$C$6)+IF(G8=10,0,Startup!$C$7)+IF(H8=12,0,Startup!$C$8)+IF(I8=14,0,Startup!$C$9)","v":9},"No"]
[0.7,1,2,4,7,8,10,12,14,{"$f":"IF(B9=0,0,Startup!$C$2)+IF(C9=2,0,Startup!$C$3)+IF(D9=4,0,Startup!$C$4)+IF(E9=6,0,Startup!$C$5)+IF(F9=8,0,Startup!$C$6)+IF(G9=10,0,Startup!$C$7)+IF(H9=12,0,Startup!$C$8)+IF(I9=14,0,Startup!$C$9)","v":9},"No"]
[0.8,1,2,4,7,8,10,12,14,{"$f":"IF(B10=0,0,Startup!$C$2)+IF(C10=2,0,Startup!$C$3)+IF(D10=4,0,Startup!$C$4)+IF(E10=6,0,Startup!$C$5)+IF(F10=8,0,Startup!$C$6)+IF(G10=10,0,Startup!$C$7)+IF(H10=12,0,Startup!$C$8)+IF(I10=14,0,Startup!$C$9)","v":9},"No"]
[0.9,1,2,4,7,8,10,12,14,{"$f":"IF(B11=0,0,Startup!$C$2)+IF(C11=2,0,Startup!$C$3)+IF(D11=4,0,Startup!$C$4)+IF(E11=6,0,Startup!$C$5)+IF(F11=8,0,Startup!$C$6)+IF(G11=10,0,Startup!$C$7)+IF(H11=12,0,Startup!$C$8)+IF(I11=14,0,Startup!$C$9)","v":9},"No"]
[1,1,2,5,7,8,10,12,14,{"$f":"IF(B12=0,0,Startup!$C$2)+IF(C12=2,0,Startup!$C$3)+IF(D12=4,0,Startup!$C$4)+IF(E12=6,0,Startup!$C$5)+IF(F12=8,0,Startup!$C$6)+IF(G12=10,0,Startup!$C$7)+IF(H12=12,0,Startup!$C$8)+IF(I12=14,0,Startup!$C$9)","v":13},"Yes"]
[1.1000000000000001,1,2,5,7,8,10,12,14,{"$f":"IF(B13=0,0,Startup!$C$2)+IF(C13=2,0,Startup!$C$3)+IF(D13=4,0,Startup!$C$4)+IF(E13=6,0,Startup!$C$5)+IF(F13=8,0,Startup!$C$6)+IF(G13=10,0,Startup!$C$7)+IF(H13=12,0,Startup!$C$8)+IF(I13=14,0,Startup!$C$9)","v":13},"No"]
[1.2,1,2,5,7,8,10,12,14,{"$f":"IF(B14=0,0,Startup!$C$2)+IF(C14=2,0,Startup!$C$3)+IF(D14=4,0,Startup!$C$4)+IF(E14=6,0,Startup!$C$5)+IF(F14=8,0,Startup!$C$6)+IF(G14=10,0,Startup!$C$7)+IF(H14=12,0,Startup!$C$8)+IF(I14=14,0,Startup!$C$9)","v":13},"No"]
[1.3,1,2,5,7,8,10,12,14,{"$f":"IF(B15=0,0,Startup!$C$2)+IF(C15=2,0,Startup!$C$3)+IF(D15=4,0,Startup!$C$4)+IF(E15=6,0,Startup!$C$5)+IF(F15=8,0,Startup!$C$6)+IF(G15=10,0,Startup!$C$7)+IF(H15=12,0,Startup!$C$8)+IF(I15=14,0,Startup!$C$9)","v":13},"No"]
[1.4,1,2,5,7,8,10,12,14,{"$f":"IF(B16=0,0,Startup!$C$2)+IF(C16=2,0,Startup!$C$3)+IF(D16=4,0,Startup!$C$4)+IF(E16=6,0,Startup!$C$5)+IF(F16=8,0,Startup!$C$6)+IF(G16=10,0,Startup!$C$7)+IF(H16=12,0,Startup!$C$8)+IF(I16=14,0,Startup!$C$9)","v":13},"No"]
[1.5,1,2,5,7,8,10,12,14,{"$f":"IF(B17=0,0,Startup!$C$2)+IF(C17=2,0,Startup!$C$3)+IF(D17=4,0,Startup!$C$4)+IF(E17=6,0,Startup!$C$5)+IF(F17=8,0,Startup!$C$6)+IF(G17=10,0,Startup!$C$7)+IF(H17=12,0,Startup!$C$8)+IF(I17=14,0,Startup!$C$9)","v":13},"No"]
[1.6,1,2,5,7,8,10,12,14,{"$f":"IF(B18=0,0,Startup!$C$2)+IF(C18=2,0,Startup!$C$3)+IF(D18=4,0,Startup!$C$4)+IF(E18=6,0,Startup!$C$5)+IF(F18=8,0,Startup!$C$6)+IF(G18=10,0,Startup!$C$7)+IF(H18=12,0,Startup!$C$8)+IF(I18=14,0,Startup!$C$9)","v":13},"No"]
[1.7,1,2,5,7,8,10,12,14,{"$f":"IF(B19=0,0,Startup!$C$2)+IF(C19=2,0,Startup!$C$3)+IF(D19=4,0,Startup!$C$4)+IF(E19=6,0,Startup!$C$5)+IF(F19=8,0,Startup!$C$6)+IF(G19=10,0,Startup!$C$7)+IF(H19=12,0,Startup!$C$8)+IF(I19=14,0,Startup!$C$9)","v":13},"No"]
[1.8,1,2,5,7,8,10,12,14,{"$f":"IF(B20=0,0,Startup!$C$2)+IF(C20=2,0,Startup!$C$3)+IF(D20=4,0,Startup!$C$4)+IF(E20=6,0,Startup!$C$5)+IF(F20=8,0,Startup!$C$6)+IF(G20=10,0,Startup!$C$7)+IF(H20=12,0,Startup!$C$8)+IF(I20=14,0,Startup!$C$9)","v":13},"No"]
[1.9,1,2,5,7,8,10,12,14,{"$f":"IF(B21=0,0,Startup!$C$2)+IF(C21=2,0,Startup!$C$3)+IF(D21=4,0,Startup!$C$4)+IF(E21=6,0,Startup!$C$5)+IF(F21=8,0,Startup!$C$6)+IF(G21=10,0,Startup!$C$7)+IF(H21=12,0,Startup!$C$8)+IF(I21=14,0,Startup!$C$9)","v":13},"No"]
[2,1,2,5,7,9,10,12,14,{"$f":"IF(B22=0,0,Startup!$C$2)+IF(C22=2,0,Startup!$C$3)+IF(D22=4,0,Startup!$C$4)+IF(E22=6,0,Startup!$C$5)+IF(F22=8,0,Startup!$C$6)+IF(G22=10,0,Startup!$C$7)+IF(H22=12,0,Startup!$C$8)+IF(I22=14,0,Startup!$C$9)","v":29},"Yes"]
[2.1,1,2,5,7,9,10,12,14,{"$f":"IF(B23=0,0,Startup!$C$2)+IF(C23=2,0,Startup!$C$3)+IF(D23=4,0,Startup!$C$4)+IF(E23=6,0,Startup!$C$5)+IF(F23=8,0,Startup!$C$6)+IF(G23=10,0,Startup!$C$7)+IF(H23=12,0,Startup!$C$8)+IF(I23=14,0,Startup!$C$9)","v":29},"No"]
[2.2000000000000002,1,2,5,7,9,10,12,14,{"$f":"IF(B24=0,0,Startup!$C$2)+IF(C24=2,0,Startup!$C$3)+IF(D24=4,0,Startup!$C$4)+IF(E24=6,0,Startup!$C$5)+IF(F24=8,0,Startup!$C$6)+IF(G24=10,0,Startup!$C$7)+IF(H24=12,0,Startup!$C$8)+IF(I24=14,0,Startup!$C$9)","v":29},"No"]
[2.2999999999999998,1,2,5,7,9,10,12,14,{"$f":"IF(B25=0,0,Startup!$C$2)+IF(C25=2,0,Startup!$C$3)+IF(D25=4,0,Startup!$C$4)+IF(E25=6,0,Startup!$C$5)+IF(F25=8,0,Startup!$C$6)+IF(G25=10,0,Startup!$C$7)+IF(H25=12,0,Startup!$C$8)+IF(I25=14,0,Startup!$C$9)","v":29},"No"]
[2.4,1,2,5,7,9,10,12,14,{"$f":"IF(B26=0,0,Startup!$C$2)+IF(C26=2,0,Startup!$C$3)+IF(D26=4,0,Startup!$C$4)+IF(E26=6,0,Startup!$C$5)+IF(F26=8,0,Startup!$C$6)+IF(G26=10,0,Startup!$C$7)+IF(H26=12,0,Startup!$C$8)+IF(I26=14,0,Startup!$C$9)","v":29},"No"]
[2.5,1,2,5,7,9,10,12,14,{"$f":"IF(B27=0,0,Startup!$C$2)+IF(C27=2,0,Startup!$C$3)+IF(D27=4,0,Startup!$C$4)+IF(E27=6,0,Startup!$C$5)+IF(F27=8,0,Startup!$C$6)+IF(G27=10,0,Startup!$C$7)+IF(H27=12,0,Startup!$C$8)+IF(I27=14,0,Startup!$C$9)","v":29},"No"]
[2.6,1,2,5,7,9,10,12,14,{"$f":"IF(B28=0,0,Startup!$C$2)+IF(C28=2,0,Startup!$C$3)+IF(D28=4,0,Startup!$C$4)+IF(E28=6,0,Startup!$C$5)+IF(F28=8,0,Startup!$C$6)+IF(G28=10,0,Startup!$C$7)+IF(H28=12,0,Startup!$C$8)+IF(I28=14,0,Startup!$C$9)","v":29},"No"]
[2.7,1,2,5,7,9,10,12,14,{"$f":"IF(B29=0,0,Startup!$C$2)+IF(C29=2,0,Startup!$C$3)+IF(D29=4,0,Startup!$C$4)+IF(E29=6,0,Startup!$C$5)+IF(F29=8,0,Startup!$C$6)+IF(G29=10,0,Startup!$C$7)+IF(H29=12,0,Startup!$C$8)+IF(I29=14,0,Startup!$C$9)","v":29},"No"]
[2.8,1,2,5,7,9,10,12,14,{"$f":"IF(B30=0,0,Startup!$C$2)+IF(C30=2,0,Startup!$C$3)+IF(D30=4,0,Startup!$C$4)+IF(E30=6,0,Startup!$C$5)+IF(F30=8,0,Startup!$C$6)+IF(G30=10,0,Startup!$C$7)+IF(H30=12,0,Startup!$C$8)+IF(I30=14,0,Startup!$C$9)","v":29},"No"]
[2.9,1,2,5,7,9,10,12,14,{"$f":"IF(B31=0,0,Startup!$C$2)+IF(C31=2,0,Startup!$C$3)+IF(D31=4,0,Startup!$C$4)+IF(E31=6,0,Startup!$C$5)+IF(F31=8,0,Startup!$C$6)+IF(G31=10,0,Startup!$C$7)+IF(H31=12,0,Startup!$C$8)+IF(I31=14,0,Startup!$C$9)","v":29},"No"]
[3,1,2,5,7,9,10,12,14,{"$f":"IF(B32=0,0,Startup!$C$2)+IF(C32=2,0,Startup!$C$3)+IF(D32=4,0,Startup!$C$4)+IF(E32=6,0,Startup!$C$5)+IF(F32=8,0,Startup!$C$6)+IF(G32=10,0,Startup!$C$7)+IF(H32=12,0,Startup!$C$8)+IF(I32=14,0,Startup!$C$9)","v":29},"No"]
[3.1,1,2,5,7,9,10,12,14,{"$f":"IF(B33=0,0,Startup!$C$2)+IF(C33=2,0,Startup!$C$3)+IF(D33=4,0,Startup!$C$4)+IF(E33=6,0,Startup!$C$5)+IF(F33=8,0,Startup!$C$6)+IF(G33=10,0,Startup!$C$7)+IF(H33=12,0,Startup!$C$8)+IF(I33=14,0,Startup!$C$9)","v":29},"No"]
[3.2,1,2,5,7,9,10,12,14,{"$f":"IF(B34=0,0,Startup!$C$2)+IF(C34=2,0,Startup!$C$3)+IF(D34=4,0,Startup!$C$4)+IF(E34=6,0,Startup!$C$5)+IF(F34=8,0,Startup!$C$6)+IF(G34=10,0,Startup!$C$7)+IF(H34=12,0,Startup!$C$8)+IF(I34=14,0,Startup!$C$9)","v":29},"No"]
[3.3,1,2,5,7,9,10,12,14,{"$f":"IF(B35=0,0,Startup!$C$2)+IF(C35=2,0,Startup!$C$3)+IF(D35=4,0,Startup!$C$4)+IF(E35=6,0,Startup!$C$5)+IF(F35=8,0,Startup!$C$6)+IF(G35=10,0,Startup!$C$7)+IF(H35=12,0,Startup!$C$8)+IF(I35=14,0,Startup!$C$9)","v":29},"No"]
[3.4,1,2,5,7,9,10,12,14,{"$f":"IF(B36=0,0,Startup!$C$2)+IF(C36=2,0,Startup!$C$3)+IF(D36=4,0,Startup!$C$4)+IF(E36=6,0,Startup!$C$5)+IF(F36=8,0,Startup!$C$6)+IF(G36=10,0,Startup!$C$7)+IF(H36=12,0,Startup!$C$8)+IF(I36=14,0,Startup!$C$9)","v":29},"No"]
[3.5,1,2,5,7,9,10,12,14,{"$f":"IF(B37=0,0,Startup!$C$2)+IF(C37=2,0,Startup!$C$3)+IF(D37=4,0,Startup!$C$4)+IF(E37=6,0,Startup!$C$5)+IF(F37=8,0,Startup!$C$6)+IF(G37=10,0,Startup!$C$7)+IF(H37=12,0,Startup!$C$8)+IF(I37=14,0,Startup!$C$9)","v":29},"No"]
[3.6,1,2,5,7,9,10,12,14,{"$f":"IF(B38=0,0,Startup!$C$2)+IF(C38=2,0,Startup!$C$3)+IF(D38=4,0,Startup!$C$4)+IF(E38=6,0,Startup!$C$5)+IF(F38=8,0,Startup!$C$6)+IF(G38=10,0,Startup!$C$7)+IF(H38=12,0,Startup!$C$8)+IF(I38=14,0,Startup!$C$9)","v":29},"No"]
[3.7,1,2,5,7,9,10,12,14,{"$f":"IF(B39=0,0,Startup!$C$2)+IF(C39=2,0,Startup!$C$3)+IF(D39=4,0,Startup!$C$4)+IF(E39=6,0,Startup!$C$5)+IF(F39=8,0,Startup!$C$6)+IF(G39=10,0,Startup!$C$7)+IF(H39=12,0,Startup!$C$8)+IF(I39=14,0,Startup!$C$9)","v":29},"No"]
[3.8,1,2,5,7,9,10,12,14,{"$f":"IF(B40=0,0,Startup!$C$2)+IF(C40=2,0,Startup!$C$3)+IF(D40=4,0,Startup!$C$4)+IF(E40=6,0,Startup!$C$5)+IF(F40=8,0,Startup!$C$6)+IF(G40=10,0,Startup!$C$7)+IF(H40=12,0,Startup!$C$8)+IF(I40=14,0,Startup!$C$9)","v":29},"No"]
[3.9,1,2,5,7,9,10,12,14,{"$f":"IF(B41=0,0,Startup!$C$2)+IF(C41=2,0,Startup!$C$3)+IF(D41=4,0,Startup!$C$4)+IF(E41=6,0,Startup!$C$5)+IF(F41=8,0,Startup!$C$6)+IF(G41=10,0,Startup!$C$7)+IF(H41=12,0,Startup!$C$8)+IF(I41=14,0,Startup!$C$9)","v":29},"No"]
[4,1,2,5,7,9,10,12,14,{"$f":"IF(B42=0,0,Startup!$C$2)+IF(C42=2,0,Startup!$C$3)+IF(D42=4,0,Startup!$C$4)+IF(E42=6,0,Startup!$C$5)+IF(F42=8,0,Startup!$C$6)+IF(G42=10,0,Startup!$C$7)+IF(H42=12,0,Startup!$C$8)+IF(I42=14,0,Startup!$C$9)","v":29},"No"]
[4.0999999999999996,1,2,5,7,9,10,12,14,{"$f":"IF(B43=0,0,Startup!$C$2)+IF(C43=2,0,Startup!$C$3)+IF(D43=4,0,Startup!$C$4)+IF(E43=6,0,Startup!$C$5)+IF(F43=8,0,Startup!$C$6)+IF(G43=10,0,Startup!$C$7)+IF(H43=12,0,Startup!$C$8)+IF(I43=14,0,Startup!$C$9)","v":29},"No"]
[4.2,1,2,5,7,9,10,12,14,{"$f":"IF(B44=0,0,Startup!$C$2)+IF(C44=2,0,Startup!$C$3)+IF(D44=4,0,Startup!$C$4)+IF(E44=6,0,Startup!$C$5)+IF(F44=8,0,Startup!$C$6)+IF(G44=10,0,Startup!$C$7)+IF(H44=12,0,Startup!$C$8)+IF(I44=14,0,Startup!$C$9)","v":29},"No"]
[4.3,1,2,5,7,9,10,12,14,{"$f":"IF(B45=0,0,Startup!$C$2)+IF(C45=2,0,Startup!$C$3)+IF(D45=4,0,Startup!$C$4)+IF(E45=6,0,Startup!$C$5)+IF(F45=8,0,Startup!$C$6)+IF(G45=10,0,Startup!$C$7)+IF(H45=12,0,Startup!$C$8)+IF(I45=14,0,Startup!$C$9)","v":29},"No"]
[4.4000000000000004,1,2,5,7,9,10,12,14,{"$f":"IF(B46=0,0,Startup!$C$2)+IF(C46=2,0,Startup!$C$3)+IF(D46=4,0,Startup!$C$4)+IF(E46=6,0,Startup!$C$5)+IF(F46=8,0,Startup!$C$6)+IF(G46=10,0,Startup!$C$7)+IF(H46=12,0,Startup!$C$8)+IF(I46=14,0,Startup!$C$9)","v":29},"No"]
[4.5,1,2,5,7,9,10,12,14,{"$f":"IF(B47=0,0,Startup!$C$2)+IF(C47=2,0,Startup!$C$3)+IF(D47=4,0,Startup!$C$4)+IF(E47=6,0,Startup!$C$5)+IF(F47=8,0,Startup!$C$6)+IF(G47=10,0,Startup!$C$7)+IF(H47=12,0,Startup!$C$8)+IF(I47=14,0,Startup!$C$9)","v":29},"No"]
[4.5999999999999996,1,2,5,7,9,10,12,14,{"$f":"IF(B48=0,0,Startup!$C$2)+IF(C48=2,0,Startup!$C$3)+IF(D48=4,0,Startup!$C$4)+IF(E48=6,0,Startup!$C$5)+IF(F48=8,0,Startup!$C$6)+IF(G48=10,0,Startup!$C$7)+IF(H48=12,0,Startup!$C$8)+IF(I48=14,0,Startup!$C$9)","v":29},"No"]
[4.7,1,2,5,7,9,10,12,14,{"$f":"IF(B49=0,0,Startup!$C$2)+IF(C49=2,0,Startup!$C$3)+IF(D49=4,0,Startup!$C$4)+IF(E49=6,0,Startup!$C$5)+IF(F49=8,0,Startup!$C$6)+IF(G49=10,0,Startup!$C$7)+IF(H49=12,0,Startup!$C$8)+IF(I49=14,0,Startup!$C$9)","v":29},"No"]
[4.8,1,2,5,7,9,10,12,14,{"$f":"IF(B50=0,0,Startup!$C$2)+IF(C50=2,0,Startup!$C$3)+IF(D50=4,0,Startup!$C$4)+IF(E50=6,0,Startup!$C$5)+IF(F50=8,0,Startup!$C$6)+IF(G50=10,0,Startup!$C$7)+IF(H50=12,0,Startup!$C$8)+IF(I50=14,0,Startup!$C$9)","v":29},"No"]
[4.9000000000000004,1,2,5,7,9,10,12,14,{"$f":"IF(B51=0,0,Startup!$C$2)+IF(C51=2,0,Startup!$C$3)+IF(D51=4,0,Startup!$C$4)+IF(E51=6,0,Startup!$C$5)+IF(F51=8,0,Startup!$C$6)+IF(G51=10,0,Startup!$C$7)+IF(H51=12,0,Startup!$C$8)+IF(I51=14,0,Startup!$C$9)","v":29},"No"]
[5,1,2,5,7,8,10,12,14,{"$f":"IF(B52=0,0,Startup!$C$2)+IF(C52=2,0,Startup!$C$3)+IF(D52=4,0,Startup!$C$4)+IF(E52=6,0,Startup!$C$5)+IF(F52=8,0,Startup!$C$6)+IF(G52=10,0,Startup!$C$7)+IF(H52=12,0,Startup!$C$8)+IF(I52=14,0,Startup!$C$9)","v":13},"Yes"]
[5.0999999999999996,1,2,5,7,8,10,12,14,{"$f":"IF(B53=0,0,Startup!$C$2)+IF(C53=2,0,Startup!$C$3)+IF(D53=4,0,Startup!$C$4)+IF(E53=6,0,Startup!$C$5)+IF(F53=8,0,Startup!$C$6)+IF(G53=10,0,Startup!$C$7)+IF(H53=12,0,Startup!$C$8)+IF(I53=14,0,Startup!$C$9)","v":13},"No"]
[5.2,1,2,5,7,8,10,12,14,{"$f":"IF(B54=0,0,Startup!$C$2)+IF(C54=2,0,Startup!$C$3)+IF(D54=4,0,Startup!$C$4)+IF(E54=6,0,Startup!$C$5)+IF(F54=8,0,Startup!$C$6)+IF(G54=10,0,Startup!$C$7)+IF(H54=12,0,Startup!$C$8)+IF(I54=14,0,Startup!$C$9)","v":13},"No"]
[5.3,1,2,5,7,8,10,12,14,{"$f":"IF(B55=0,0,Startup!$C$2)+IF(C55=2,0,Startup!$C$3)+IF(D55=4,0,Startup!$C$4)+IF(E55=6,0,Startup!$C$5)+IF(F55=8,0,Startup!$C$6)+IF(G55=10,0,Startup!$C$7)+IF(H55=12,0,Startup!$C$8)+IF(I55=14,0,Startup!$C$9)","v":13},"No"]
[5.4,1,2,5,7,8,10,12,14,{"$f":"IF(B56=0,0,Startup!$C$2)+IF(C56=2,0,Startup!$C$3)+IF(D56=4,0,Startup!$C$4)+IF(E56=6,0,Startup!$C$5)+IF(F56=8,0,Startup!$C$6)+IF(G56=10,0,Startup!$C$7)+IF(H56=12,0,Startup!$C$8)+IF(I56=14,0,Startup!$C$9)","v":13},"No"]
[5.5,1,2,5,7,8,10,12,14,{"$f":"IF(B57=0,0,Startup!$C$2)+IF(C57=2,0,Startup!$C$3)+IF(D57=4,0,Startup!$C$4)+IF(E57=6,0,Startup!$C$5)+IF(F57=8,0,Startup!$C$6)+IF(G57=10,0,Startup!$C$7)+IF(H57=12,0,Startup!$C$8)+IF(I57=14,0,Startup!$C$9)","v":13},"No"]
[5.6,1,2,5,7,8,10,12,14,{"$f":"IF(B58=0,0,Startup!$C$2)+IF(C58=2,0,Startup!$C$3)+IF(D58=4,0,Startup!$C$4)+IF(E58=6,0,Startup!$C$5)+IF(F58=8,0,Startup!$C$6)+IF(G58=10,0,Startup!$C$7)+IF(H58=12,0,Startup!$C$8)+IF(I58=14,0,Startup!$C$9)","v":13},"No"]
[5.7,1,2,5,7,8,10,12,14,{"$f":"IF(B59=0,0,Startup!$C$2)+IF(C59=2,0,Startup!$C$3)+IF(D59=4,0,Startup!$C$4)+IF(E59=6,0,Startup!$C$5)+IF(F59=8,0,Startup!$C$6)+IF(G59=10,0,Startup!$C$7)+IF(H59=12,0,Startup!$C$8)+IF(I59=14,0,Startup!$C$9)","v":13},"No"]
[5.8,1,2,5,7,8,10,12,14,{"$f":"IF(B60=0,0,Startup!$C$2)+IF(C60=2,0,Startup!$C$3)+IF(D60=4,0,Startup!$C$4)+IF(E60=6,0,Startup!$C$5)+IF(F60=8,0,Startup!$C$6)+IF(G60=10,0,Startup!$C$7)+IF(H60=12,0,Startup!$C$8)+IF(I60=14,0,Startup!$C$9)","v":13},"No"]
[5.9,1,2,5,7,8,10,12,14,{"$f":"IF(B61=0,0,Startup!$C$2)+IF(C61=2,0,Startup!$C$3)+IF(D61=4,0,Startup!$C$4)+IF(E61=6,0,Startup!$C$5)+IF(F61=8,0,Startup!$C$6)+IF(G61=10,0,Startup!$C$7)+IF(H61=12,0,Startup!$C$8)+IF(I61=14,0,Startup!$C$9)","v":13},"No"]
[6,1,2,5,7,8,10,12,14,{"$f":"IF(B62=0,0,Startup!$C$2)+IF(C62=2,0,Startup!$C$3)+IF(D62=4,0,Startup!$C$4)+IF(E62=6,0,Startup!$C$5)+IF(F62=8,0,Startup!$C$6)+IF(G62=10,0,Startup!$C$7)+IF(H62=12,0,Startup!$C$8)+IF(I62=14,0,Startup!$C$9)","v":13},"No"]
[6.1,1,2,5,7,8,10,12,14,{"$f":"IF(B63=0,0,Startup!$C$2)+IF(C63=2,0,Startup!$C$3)+IF(D63=4,0,Startup!$C$4)+IF(E63=6,0,Startup!$C$5)+IF(F63=8,0,Startup!$C$6)+IF(G63=10,0,Startup!$C$7)+IF(H63=12,0,Startup!$C$8)+IF(I63=14,0,Startup!$C$9)","v":13},"No"]
[6.2,1,2,5,7,8,10,12,14,{"$f":"IF(B64=0,0,Startup!$C$2)+IF(C64=2,0,Startup!$C$3)+IF(D64=4,0,Startup!$C$4)+IF(E64=6,0,Startup!$C$5)+IF(F64=8,0,Startup!$C$6)+IF(G64=10,0,Startup!$C$7)+IF(H64=12,0,Startup!$C$8)+IF(I64=14,0,Startup!$C$9)","v":13},"No"]
[6.3,1,2,5,7,8,10,12,14,{"$f":"IF(B65=0,0,Startup!$C$2)+IF(C65=2,0,Startup!$C$3)+IF(D65=4,0,Startup!$C$4)+IF(E65=6,0,Startup!$C$5)+IF(F65=8,0,Startup!$C$6)+IF(G65=10,0,Startup!$C$7)+IF(H65=12,0,Startup!$C$8)+IF(I65=14,0,Startup!$C$9)","v":13},"No"]
[6.4,1,2,5,7,8,10,12,14,{"$f":"IF(B66=0,0,Startup!$C$2)+IF(C66=2,0,Startup!$C$3)+IF(D66=4,0,Startup!$C$4)+IF(E66=6,0,Startup!$C$5)+IF(F66=8,0,Startup!$C$6)+IF(G66=10,0,Startup!$C$7)+IF(H66=12,0,Startup!$C$8)+IF(I66=14,0,Startup!$C$9)","v":13},"No"]
[6.5,1,2,5,7,8,10,12,14,{"$f":"IF(B67=0,0,Startup!$C$2)+IF(C67=2,0,Startup!$C$3)+IF(D67=4,0,Startup!$C$4)+IF(E67=6,0,Startup!$C$5)+IF(F67=8,0,Startup!$C$6)+IF(G67=10,0,Startup!$C$7)+IF(H67=12,0,Startup!$C$8)+IF(I67=14,0,Startup!$C$9)","v":13},"No"]
[6.6,1,2,5,7,8,10,12,14,{"$f":"IF(B68=0,0,Startup!$C$2)+IF(C68=2,0,Startup!$C$3)+IF(D68=4,0,Startup!$C$4)+IF(E68=6,0,Startup!$C$5)+IF(F68=8,0,Startup!$C$6)+IF(G68=10,0,Startup!$C$7)+IF(H68=12,0,Startup!$C$8)+IF(I68=14,0,Startup!$C$9)","v":13},{"$f":"IF(J68<>J67,\"Yes\",\"No\")","v":"No"}]
[6.7,1,2,5,7,8,10,12,14,{"$f":"IF(B69=0,0,Startup!$C$2)+IF(C69=2,0,Startup!$C$3)+IF(D69=4,0,Startup!$C$4)+IF(E69=6,0,Startup!$C$5)+IF(F69=8,0,Startup!$C$6)+IF(G69=10,0,Startup!$C$7)+IF(H69=12,0,Startup!$C$8)+IF(I69=14,0,Startup!$C$9)","v":13},"No"]
[6.8,1,2,5,7,8,10,12,14,{"$f":"IF(B70=0,0,Startup!$C$2)+IF(C70=2,0,Startup!$C$3)+IF(D70=4,0,Startup!$C$4)+IF(E70=6,0,Startup!$C$5)+IF(F70=8,0,Startup!$C$6)+IF(G70=10,0,Startup!$C$7)+IF(H70=12,0,Startup!$C$8)+IF(I70=14,0,Startup!$C$9)","v":13},"No"]
[6.9,1,2,5,7,8,10,12,14,{"$f":"IF(B71=0,0,Startup!$C$2)+IF(C71=2,0,Startup!$C$3)+IF(D71=4,0,Startup!$C$4)+IF(E71=6,0,Startup!$C$5)+IF(F71=8,0,Startup!$C$6)+IF(G71=10,0,Startup!$C$7)+IF(H71=12,0,Startup!$C$8)+IF(I71=14,0,Startup!$C$9)","v":13},"No"]
[7,1,2,5,7,8,10,12,14,{"$f":"IF(B72=0,0,Startup!$C$2)+IF(C72=2,0,Startup!$C$3)+IF(D72=4,0,Startup!$C$4)+IF(E72=6,0,Startup!$C$5)+IF(F72=8,0,Startup!$C$6)+IF(G72=10,0,Startup!$C$7)+IF(H72=12,0,Startup!$C$8)+IF(I72=14,0,Startup!$C$9)","v":13},"No"]
[7.1,1,2,5,7,8,10,12,14,{"$f":"IF(B73=0,0,Startup!$C$2)+IF(C73=2,0,Startup!$C$3)+IF(D73=4,0,Startup!$C$4)+IF(E73=6,0,Startup!$C$5)+IF(F73=8,0,Startup!$C$6)+IF(G73=10,0,Startup!$C$7)+IF(H73=12,0,Startup!$C$8)+IF(I73=14,0,Startup!$C$9)","v":13},"No"]
[7.2,1,2,5,7,8,10,12,14,{"$f":"IF(B74=0,0,Startup!$C$2)+IF(C74=2,0,Startup!$C$3)+IF(D74=4,0,Startup!$C$4)+IF(E74=6,0,Startup!$C$5)+IF(F74=8,0,Startup!$C$6)+IF(G74=10,0,Startup!$C$7)+IF(H74=12,0,Startup!$C$8)+IF(I74=14,0,Startup!$C$9)","v":13},"No"]
[7.3,1,2,5,7,8,10,12,14,{"$f":"IF(B75=0,0,Startup!$C$2)+IF(C75=2,0,Startup!$C$3)+IF(D75=4,0,Startup!$C$4)+IF(E75=6,0,Startup!$C$5)+IF(F75=8,0,Startup!$C$6)+IF(G75=10,0,Startup!$C$7)+IF(H75=12,0,Startup!$C$8)+IF(I75=14,0,Startup!$C$9)","v":13},"No"]
[7.4,1,2,5,7,8,10,12,14,{"$f":"IF(B76=0,0,Startup!$C$2)+IF(C76=2,0,Startup!$C$3)+IF(D76=4,0,Startup!$C$4)+IF(E76=6,0,Startup!$C$5)+IF(F76=8,0,Startup!$C$6)+IF(G76=10,0,Startup!$C$7)+IF(H76=12,0,Startup!$C$8)+IF(I76=14,0,Startup!$C$9)","v":13},"No"]
[7.5,1,2,5,7,8,10,12,14,{"$f":"IF(B77=0,0,Startup!$C$2)+IF(C77=2,0,Startup!$C$3)+IF(D77=4,0,Startup!$C$4)+IF(E77=6,0,Startup!$C$5)+IF(F77=8,0,Startup!$C$6)+IF(G77=10,0,Startup!$C$7)+IF(H77=12,0,Startup!$C$8)+IF(I77=14,0,Startup!$C$9)","v":13},"No"]
[7.6,1,2,5,7,8,10,12,14,{"$f":"IF(B78=0,0,Startup!$C$2)+IF(C78=2,0,Startup!$C$3)+IF(D78=4,0,Startup!$C$4)+IF(E78=6,0,Startup!$C$5)+IF(F78=8,0,Startup!$C$6)+IF(G78=10,0,Startup!$C$7)+IF(H78=12,0,Startup!$C$8)+IF(I78=14,0,Startup!$C$9)","v":13},"No"]
[7.7,1,2,5,7,8,10,12,14,{"$f":"IF(B79=0,0,Startup!$C$2)+IF(C79=2,0,Startup!$C$3)+IF(D79=4,0,Startup!$C$4)+IF(E79=6,0,Startup!$C$5)+IF(F79=8,0,Startup!$C$6)+IF(G79=10,0,Startup!$C$7)+IF(H79=12,0,Startup!$C$8)+IF(I79=14,0,Startup!$C$9)","v":13},"No"]
[7.8,1,2,5,7,8,10,12,14,{"$f":"IF(B80=0,0,Startup!$C$2)+IF(C80=2,0,Startup!$C$3)+IF(D80=4,0,Startup!$C$4)+IF(E80=6,0,Startup!$C$5)+IF(F80=8,0,Startup!$C$6)+IF(G80=10,0,Startup!$C$7)+IF(H80=12,0,Startup!$C$8)+IF(I80=14,0,Startup!$C$9)","v":13},"No"]
[7.9,1,2,5,7,8,10,12,14,{"$f":"IF(B81=0,0,Startup!$C$2)+IF(C81=2,0,Startup!$C$3)+IF(D81=4,0,Startup!$C$4)+IF(E81=6,0,Startup!$C$5)+IF(F81=8,0,Startup!$C$6)+IF(G81=10,0,Startup!$C$7)+IF(H81=12,0,Startup!$C$8)+IF(I81=14,0,Startup!$C$9)","v":13},"No"]
[8,1,2,5,6,8,10,12,14,{"$f":"IF(B82=0,0,Startup!$C$2)+IF(C82=2,0,Startup!$C$3)+IF(D82=4,0,Startup!$C$4)+IF(E82=6,0,Startup!$C$5)+IF(F82=8,0,Startup!$C$6)+IF(G82=10,0,Startup!$C$7)+IF(H82=12,0,Startup!$C$8)+IF(I82=14,0,Startup!$C$9)","v":5},"Yes"]
[8.1,1,2,5,6,8,10,12,14,{"$f":"IF(B83=0,0,Startup!$C$2)+IF(C83=2,0,Startup!$C$3)+IF(D83=4,0,Startup!$C$4)+IF(E83=6,0,Startup!$C$5)+IF(F83=8,0,Startup!$C$6)+IF(G83=10,0,Startup!$C$7)+IF(H83=12,0,Startup!$C$8)+IF(I83=14,0,Startup!$C$9)","v":5},"No"]
[8.1999999999999993,1,2,5,6,8,10,12,14,{"$f":"IF(B84=0,0,Startup!$C$2)+IF(C84=2,0,Startup!$C$3)+IF(D84=4,0,Startup!$C$4)+IF(E84=6,0,Startup!$C$5)+IF(F84=8,0,Startup!$C$6)+IF(G84=10,0,Startup!$C$7)+IF(H84=12,0,Startup!$C$8)+IF(I84=14,0,Startup!$C$9)","v":5},"No"]
[8.3000000000000007,1,2,5,6,8,10,12,14,{"$f":"IF(B85=0,0,Startup!$C$2)+IF(C85=2,0,Startup!$C$3)+IF(D85=4,0,Startup!$C$4)+IF(E85=6,0,Startup!$C$5)+IF(F85=8,0,Startup!$C$6)+IF(G85=10,0,Startup!$C$7)+IF(H85=12,0,Startup!$C$8)+IF(I85=14,0,Startup!$C$9)","v":5},"No"]
[8.4,1,2,5,6,8,10,12,14,{"$f":"IF(B86=0,0,Startup!$C$2)+IF(C86=2,0,Startup!$C$3)+IF(D86=4,0,Startup!$C$4)+IF(E86=6,0,Startup!$C$5)+IF(F86=8,0,Startup!$C$6)+IF(G86=10,0,Startup!$C$7)+IF(H86=12,0,Startup!$C$8)+IF(I86=14,0,Startup!$C$9)","v":5},"No"]
[8.5,1,2,5,6,8,10,12,14,{"$f":"IF(B87=0,0,Startup!$C$2)+IF(C87=2,0,Startup!$C$3)+IF(D87=4,0,Startup!$C$4)+IF(E87=6,0,Startup!$C$5)+IF(F87=8,0,Startup!$C$6)+IF(G87=10,0,Startup!$C$7)+IF(H87=12,0,Startup!$C$8)+IF(I87=14,0,Startup!$C$9)","v":5},"No"]
[8.6,1,2,5,6,8,10,12,14,{"$f":"IF(B88=0,0,Startup!$C$2)+IF(C88=2,0,Startup!$C$3)+IF(D88=4,0,Startup!$C$4)+IF(E88=6,0,Startup!$C$5)+IF(F88=8,0,Startup!$C$6)+IF(G88=10,0,Startup!$C$7)+IF(H88=12,0,Startup!$C$8)+IF(I88=14,0,Startup!$C$9)","v":5},"No"]
[8.6999999999999993,1,2,5,6,8,10,12,14,{"$f":"IF(B89=0,0,Startup!$C$2)+IF(C89=2,0,Startup!$C$3)+IF(D89=4,0,Startup!$C$4)+IF(E89=6,0,Startup!$C$5)+IF(F89=8,0,Startup!$C$6)+IF(G89=10,0,Startup!$C$7)+IF(H89=12,0,Startup!$C$8)+IF(I89=14,0,Startup!$C$9)","v":5},"No"]
[8.8000000000000007,1,2,5,6,8,10,12,14,{"$f":"IF(B90=0,0,Startup!$C$2)+IF(C90=2,0,Startup!$C$3)+IF(D90=4,0,Startup!$C$4)+IF(E90=6,0,Startup!$C$5)+IF(F90=8,0,Startup!$C$6)+IF(G90=10,0,Startup!$C$7)+IF(H90=12,0,Startup!$C$8)+IF(I90=14,0,Startup!$C$9)","v":5},"No"]
[8.9,1,2,5,6,8,10,12,14,{"$f":"IF(B91=0,0,Startup!$C$2)+IF(C91=2,0,Startup!$C$3)+IF(D91=4,0,Startup!$C$4)+IF(E91=6,0,Startup!$C$5)+IF(F91=8,0,Startup!$C$6)+IF(G91=10,0,Startup!$C$7)+IF(H91=12,0,Startup!$C$8)+IF(I91=14,0,Startup!$C$9)","v":5},"No"]
[9,1,2,5,6,8,10,12,14,{"$f":"IF(B92=0,0,Startup!$C$2)+IF(C92=2,0,Startup!$C$3)+IF(D92=4,0,Startup!$C$4)+IF(E92=6,0,Startup!$C$5)+IF(F92=8,0,Startup!$C$6)+IF(G92=10,0,Startup!$C$7)+IF(H92=12,0,Startup!$C$8)+IF(I92=14,0,Startup!$C$9)","v":5},"No"]
[9.1,1,2,5,6,8,10,12,14,{"$f":"IF(B93=0,0,Startup!$C$2)+IF(C93=2,0,Startup!$C$3)+IF(D93=4,0,Startup!$C$4)+IF(E93=6,0,Startup!$C$5)+IF(F93=8,0,Startup!$C$6)+IF(G93=10,0,Startup!$C$7)+IF(H93=12,0,Startup!$C$8)+IF(I93=14,0,Startup!$C$9)","v":5},"No"]
[9.1999999999999993,1,2,5,6,8,10,12,14,{"$f":"IF(B94=0,0,Startup!$C$2)+IF(C94=2,0,Startup!$C$3)+IF(D94=4,0,Startup!$C$4)+IF(E94=6,0,Startup!$C$5)+IF(F94=8,0,Startup!$C$6)+IF(G94=10,0,Startup!$C$7)+IF(H94=12,0,Startup!$C$8)+IF(I94=14,0,Startup!$C$9)","v":5},"No"]
[9.3000000000000007,1,2,5,6,8,10,12,14,{"$f":"IF(B95=0,0,Startup!$C$2)+IF(C95=2,0,Startup!$C$3)+IF(D95=4,0,Startup!$C$4)+IF(E95=6,0,Startup!$C$5)+IF(F95=8,0,Startup!$C$6)+IF(G95=10,0,Startup!$C$7)+IF(H95=12,0,Startup!$C$8)+IF(I95=14,0,Startup!$C$9)","v":5},"No"]
[9.4,1,2,5,6,8,10,12,14,{"$f":"IF(B96=0,0,Startup!$C$2)+IF(C96=2,0,Startup!$C$3)+IF(D96=4,0,Startup!$C$4)+IF(E96=6,0,Startup!$C$5)+IF(F96=8,0,Startup!$C$6)+IF(G96=10,0,Startup!$C$7)+IF(H96=12,0,Startup!$C$8)+IF(I96=14,0,Startup!$C$9)","v":5},"No"]
[9.5,1,2,5,6,8,10,12,14,{"$f":"IF(B97=0,0,Startup!$C$2)+IF(C97=2,0,Startup!$C$3)+IF(D97=4,0,Startup!$C$4)+IF(E97=6,0,Startup!$C$5)+IF(F97=8,0,Startup!$C$6)+IF(G97=10,0,Startup!$C$7)+IF(H97=12,0,Startup!$C$8)+IF(I97=14,0,Startup!$C$9)","v":5},"No"]
[9.6,1,2,5,6,8,10,12,14,{"$f":"IF(B98=0,0,Startup!$C$2)+IF(C98=2,0,Startup!$C$3)+IF(D98=4,0,Startup!$C$4)+IF(E98=6,0,Startup!$C$5)+IF(F98=8,0,Startup!$C$6)+IF(G98=10,0,Startup!$C$7)+IF(H98=12,0,Startup!$C$8)+IF(I98=14,0,Startup!$C$9)","v":5},"No"]
[9.6999999999999993,1,2,5,6,8,10,12,14,{"$f":"IF(B99=0,0,Startup!$C$2)+IF(C99=2,0,Startup!$C$3)+IF(D99=4,0,Startup!$C$4)+IF(E99=6,0,Startup!$C$5)+IF(F99=8,0,Startup!$C$6)+IF(G99=10,0,Startup!$C$7)+IF(H99=12,0,Startup!$C$8)+IF(I99=14,0,Startup!$C$9)","v":5},"No"]
[9.8000000000000007,1,2,5,6,8,10,12,14,{"$f":"IF(B100=0,0,Startup!$C$2)+IF(C100=2,0,Startup!$C$3)+IF(D100=4,0,Startup!$C$4)+IF(E100=6,0,Startup!$C$5)+IF(F100=8,0,Startup!$C$6)+IF(G100=10,0,Startup!$C$7)+IF(H100=12,0,Startup!$C$8)+IF(I100=14,0,Startup!$C$9)","v":5},"No"]
[9.9,1,2,5,6,8,10,12,14,{"$f":"IF(B101=0,0,Startup!$C$2)+IF(C101=2,0,Startup!$C$3)+IF(D101=4,0,Startup!$C$4)+IF(E101=6,0,Startup!$C$5)+IF(F101=8,0,Startup!$C$6)+IF(G101=10,0,Startup!$C$7)+IF(H101=12,0,Startup!$C$8)+IF(I101=14,0,Startup!$C$9)","v":5},"No"]
[10,1,2,5,6,8,10,12,14,{"$f":"IF(B102=0,0,Startup!$C$2)+IF(C102=2,0,Startup!$C$3)+IF(D102=4,0,Startup!$C$4)+IF(E102=6,0,Startup!$C$5)+IF(F102=8,0,Startup!$C$6)+IF(G102=10,0,Startup!$C$7)+IF(H102=12,0,Startup!$C$8)+IF(I102=14,0,Startup!$C$9)","v":5},"No"]
[10.1,1,2,5,6,8,10,12,14,{"$f":"IF(B103=0,0,Startup!$C$2)+IF(C103=2,0,Startup!$C$3)+IF(D103=4,0,Startup!$C$4)+IF(E103=6,0,Startup!$C$5)+IF(F103=8,0,Startup!$C$6)+IF(G103=10,0,Startup!$C$7)+IF(H103=12,0,Startup!$C$8)+IF(I103=14,0,Startup!$C$9)","v":5},"No"]
[10.199999999999999,1,2,5,6,8,10,12,14,{"$f":"IF(B104=0,0,Startup!$C$2)+IF(C104=2,0,Startup!$C$3)+IF(D104=4,0,Startup!$C$4)+IF(E104=6,0,Startup!$C$5)+IF(F104=8,0,Startup!$C$6)+IF(G104=10,0,Startup!$C$7)+IF(H104=12,0,Startup!$C$8)+IF(I104=14,0,Startup!$C$9)","v":5},"No"]
[10.3,1,2,5,6,8,10,12,14,{"$f":"IF(B105=0,0,Startup!$C$2)+IF(C105=2,0,Startup!$C$3)+IF(D105=4,0,Startup!$C$4)+IF(E105=6,0,Startup!$C$5)+IF(F105=8,0,Startup!$C$6)+IF(G105=10,0,Startup!$C$7)+IF(H105=12,0,Startup!$C$8)+IF(I105=14,0,Startup!$C$9)","v":5},"No"]
[10.4,1,2,5,6,8,10,12,14,{"$f":"IF(B106=0,0,Startup!$C$2)+IF(C106=2,0,Startup!$C$3)+IF(D106=4,0,Startup!$C$4)+IF(E106=6,0,Startup!$C$5)+IF(F106=8,0,Startup!$C$6)+IF(G106=10,0,Startup!$C$7)+IF(H106=12,0,Startup!$C$8)+IF(I106=14,0,Startup!$C$9)","v":5},"No"]
[10.5,1,2,5,6,8,10,12,14,{"$f":"IF(B107=0,0,Startup!$C$2)+IF(C107=2,0,Startup!$C$3)+IF(D107=4,0,Startup!$C$4)+IF(E107=6,0,Startup!$C$5)+IF(F107=8,0,Startup!$C$6)+IF(G107=10,0,Startup!$C$7)+IF(H107=12,0,Startup!$C$8)+IF(I107=14,0,Startup!$C$9)","v":5},"No"]
[10.6,1,2,5,6,8,10,12,14,{"$f":"IF(B108=0,0,Startup!$C$2)+IF(C108=2,0,Startup!$C$3)+IF(D108=4,0,Startup!$C$4)+IF(E108=6,0,Startup!$C$5)+IF(F108=8,0,Startup!$C$6)+IF(G108=10,0,Startup!$C$7)+IF(H108=12,0,Startup!$C$8)+IF(I108=14,0,Startup!$C$9)","v":5},"No"]
[10.7,1,2,5,6,8,10,12,14,{"$f":"IF(B109=0,0,Startup!$C$2)+IF(C109=2,0,Startup!$C$3)+IF(D109=4,0,Startup!$C$4)+IF(E109=6,0,Startup!$C$5)+IF(F109=8,0,Startup!$C$6)+IF(G109=10,0,Startup!$C$7)+IF(H109=12,0,Startup!$C$8)+IF(I109=14,0,Startup!$C$9)","v":5},"No"]
[10.8,1,2,5,6,8,10,12,14,{"$f":"IF(B110=0,0,Startup!$C$2)+IF(C110=2,0,Startup!$C$3)+IF(D110=4,0,Startup!$C$4)+IF(E110=6,0,Startup!$C$5)+IF(F110=8,0,Startup!$C$6)+IF(G110=10,0,Startup!$C$7)+IF(H110=12,0,Startup!$C$8)+IF(I110=14,0,Startup!$C$9)","v":5},"No"]
[10.9,1,2,5,6,8,10,12,14,{"$f":"IF(B111=0,0,Startup!$C$2)+IF(C111=2,0,Startup!$C$3)+IF(D111=4,0,Startup!$C$4)+IF(E111=6,0,Startup!$C$5)+IF(F111=8,0,Startup!$C$6)+IF(G111=10,0,Startup!$C$7)+IF(H111=12,0,Startup!$C$8)+IF(I111=14,0,Startup!$C$9)","v":5},"No"]
[11,1,2,5,6,8,10,12,14,{"$f":"IF(B112=0,0,Startup!$C$2)+IF(C112=2,0,Startup!$C$3)+IF(D112=4,0,Startup!$C$4)+IF(E112=6,0,Startup!$C$5)+IF(F112=8,0,Startup!$C$6)+IF(G112=10,0,Startup!$C$7)+IF(H112=12,0,Startup!$C$8)+IF(I112=14,0,Startup!$C$9)","v":5},"No"]
[11.1,1,2,5,6,8,10,12,14,{"$f":"IF(B113=0,0,Startup!$C$2)+IF(C113=2,0,Startup!$C$3)+IF(D113=4,0,Startup!$C$4)+IF(E113=6,0,Startup!$C$5)+IF(F113=8,0,Startup!$C$6)+IF(G113=10,0,Startup!$C$7)+IF(H113=12,0,Startup!$C$8)+IF(I113=14,0,Startup!$C$9)","v":5},"No"]
[11.2,1,2,5,6,8,10,12,14,{"$f":"IF(B114=0,0,Startup!$C$2)+IF(C114=2,0,Startup!$C$3)+IF(D114=4,0,Startup!$C$4)+IF(E114=6,0,Startup!$C$5)+IF(F114=8,0,Startup!$C$6)+IF(G114=10,0,Startup!$C$7)+IF(H114=12,0,Startup!$C$8)+IF(I114=14,0,Startup!$C$9)","v":5},"No"]
[11.3,1,2,5,6,8,10,12,14,{"$f":"IF(B115=0,0,Startup!$C$2)+IF(C115=2,0,Startup!$C$3)+IF(D115=4,0,Startup!$C$4)+IF(E115=6,0,Startup!$C$5)+IF(F115=8,0,Startup!$C$6)+IF(G115=10,0,Startup!$C$7)+IF(H115=12,0,Startup!$C$8)+IF(I115=14,0,Startup!$C$9)","v":5},"No"]
[11.4,1,2,5,6,8,10,12,14,{"$f":"IF(B116=0,0,Startup!$C$2)+IF(C116=2,0,Startup!$C$3)+IF(D116=4,0,Startup!$C$4)+IF(E116=6,0,Startup!$C$5)+IF(F116=8,0,Startup!$C$6)+IF(G116=10,0,Startup!$C$7)+IF(H116=12,0,Startup!$C$8)+IF(I116=14,0,Startup!$C$9)","v":5},"No"]
[11.5,1,2,5,6,8,10,12,14,{"$f":"IF(B117=0,0,Startup!$C$2)+IF(C117=2,0,Startup!$C$3)+IF(D117=4,0,Startup!$C$4)+IF(E117=6,0,Startup!$C$5)+IF(F117=8,0,Startup!$C$6)+IF(G117=10,0,Startup!$C$7)+IF(H117=12,0,Startup!$C$8)+IF(I117=14,0,Startup!$C$9)","v":5},"No"]
[11.6,1,2,5,6,8,10,12,14,{"$f":"IF(B118=0,0,Startup!$C$2)+IF(C118=2,0,Startup!$C$3)+IF(D118=4,0,Startup!$C$4)+IF(E118=6,0,Startup!$C$5)+IF(F118=8,0,Startup!$C$6)+IF(G118=10,0,Startup!$C$7)+IF(H118=12,0,Startup!$C$8)+IF(I118=14,0,Startup!$C$9)","v":5},"No"]
[11.7,1,2,5,6,8,10,12,14,{"$f":"IF(B119=0,0,Startup!$C$2)+IF(C119=2,0,Startup!$C$3)+IF(D119=4,0,Startup!$C$4)+IF(E119=6,0,Startup!$C$5)+IF(F119=8,0,Startup!$C$6)+IF(G119=10,0,Startup!$C$7)+IF(H119=12,0,Startup!$C$8)+IF(I119=14,0,Startup!$C$9)","v":5},"No"]
[11.8,1,2,5,6,8,10,12,14,{"$f":"IF(B120=0,0,Startup!$C$2)+IF(C120=2,0,Startup!$C$3)+IF(D120=4,0,Startup!$C$4)+IF(E120=6,0,Startup!$C$5)+IF(F120=8,0,Startup!$C$6)+IF(G120=10,0,Startup!$C$7)+IF(H120=12,0,Startup!$C$8)+IF(I120=14,0,Startup!$C$9)","v":5},"No"]
[11.9,1,2,5,6,8,10,12,14,{"$f":"IF(B121=0,0,Startup!$C$2)+IF(C121=2,0,Startup!$C$3)+IF(D121=4,0,Startup!$C$4)+IF(E121=6,0,Startup!$C$5)+IF(F121=8,0,Startup!$C$6)+IF(G121=10,0,Startup!$C$7)+IF(H121=12,0,Startup!$C$8)+IF(I121=14,0,Startup!$C$9)","v":5},"No"]
[12,1,2,5,6,8,10,12,14,{"$f":"IF(B122=0,0,Startup!$C$2)+IF(C122=2,0,Startup!$C$3)+IF(D122=4,0,Startup!$C$4)+IF(E122=6,0,Startup!$C$5)+IF(F122=8,0,Startup!$C$6)+IF(G122=10,0,Startup!$C$7)+IF(H122=12,0,Startup!$C$8)+IF(I122=14,0,Startup!$C$9)","v":5},"No"]
[12.1,1,2,5,6,8,10,12,14,{"$f":"IF(B123=0,0,Startup!$C$2)+IF(C123=2,0,Startup!$C$3)+IF(D123=4,0,Startup!$C$4)+IF(E123=6,0,Startup!$C$5)+IF(F123=8,0,Startup!$C$6)+IF(G123=10,0,Startup!$C$7)+IF(H123=12,0,Startup!$C$8)+IF(I123=14,0,Startup!$C$9)","v":5},"No"]
[12.2,1,2,5,6,8,10,12,14,{"$f":"IF(B124=0,0,Startup!$C$2)+IF(C124=2,0,Startup!$C$3)+IF(D124=4,0,Startup!$C$4)+IF(E124=6,0,Startup!$C$5)+IF(F124=8,0,Startup!$C$6)+IF(G124=10,0,Startup!$C$7)+IF(H124=12,0,Startup!$C$8)+IF(I124=14,0,Startup!$C$9)","v":5},"No"]
[12.3,1,2,5,6,8,10,12,14,{"$f":"IF(B125=0,0,Startup!$C$2)+IF(C125=2,0,Startup!$C$3)+IF(D125=4,0,Startup!$C$4)+IF(E125=6,0,Startup!$C$5)+IF(F125=8,0,Startup!$C$6)+IF(G125=10,0,Startup!$C$7)+IF(H125=12,0,Startup!$C$8)+IF(I125=14,0,Startup!$C$9)","v":5},"No"]
[12.4,1,2,5,6,8,10,12,14,{"$f":"IF(B126=0,0,Startup!$C$2)+IF(C126=2,0,Startup!$C$3)+IF(D126=4,0,Startup!$C$4)+IF(E126=6,0,Startup!$C$5)+IF(F126=8,0,Startup!$C$6)+IF(G126=10,0,Startup!$C$7)+IF(H126=12,0,Startup!$C$8)+IF(I126=14,0,Startup!$C$9)","v":5},"No"]
[12.5,1,2,5,6,8,10,12,14,{"$f":"IF(B127=0,0,Startup!$C$2)+IF(C127=2,0,Startup!$C$3)+IF(D127=4,0,Startup!$C$4)+IF(E127=6,0,Startup!$C$5)+IF(F127=8,0,Startup!$C$6)+IF(G127=10,0,Startup!$C$7)+IF(H127=12,0,Startup!$C$8)+IF(I127=14,0,Startup!$C$9)","v":5},"No"]
[12.6,1,2,5,6,8,10,12,14,{"$f":"IF(B128=0,0,Startup!$C$2)+IF(C128=2,0,Startup!$C$3)+IF(D128=4,0,Startup!$C$4)+IF(E128=6,0,Startup!$C$5)+IF(F128=8,0,Startup!$C$6)+IF(G128=10,0,Startup!$C$7)+IF(H128=12,0,Startup!$C$8)+IF(I128=14,0,Startup!$C$9)","v":5},"No"]
[12.7,1,2,5,6,8,10,12,14,{"$f":"IF(B129=0,0,Startup!$C$2)+IF(C129=2,0,Startup!$C$3)+IF(D129=4,0,Startup!$C$4)+IF(E129=6,0,Startup!$C$5)+IF(F129=8,0,Startup!$C$6)+IF(G129=10,0,Startup!$C$7)+IF(H129=12,0,Startup!$C$8)+IF(I129=14,0,Startup!$C$9)","v":5},"No"]
[12.8,1,2,5,6,8,10,12,14,{"$f":"IF(B130=0,0,Startup!$C$2)+IF(C130=2,0,Startup!$C$3)+IF(D130=4,0,Startup!$C$4)+IF(E130=6,0,Startup!$C$5)+IF(F130=8,0,Startup!$C$6)+IF(G130=10,0,Startup!$C$7)+IF(H130=12,0,Startup!$C$8)+IF(I130=14,0,Startup!$C$9)","v":5},"No"]
[12.9,1,2,5,6,8,10,12,14,{"$f":"IF(B131=0,0,Startup!$C$2)+IF(C131=2,0,Startup!$C$3)+IF(D131=4,0,Startup!$C$4)+IF(E131=6,0,Startup!$C$5)+IF(F131=8,0,Startup!$C$6)+IF(G131=10,0,Startup!$C$7)+IF(H131=12,0,Startup!$C$8)+IF(I131=14,0,Startup!$C$9)","v":5},"No"]
[13,1,2,5,6,8,10,12,14,{"$f":"IF(B132=0,0,Startup!$C$2)+IF(C132=2,0,Startup!$C$3)+IF(D132=4,0,Startup!$C$4)+IF(E132=6,0,Startup!$C$5)+IF(F132=8,0,Startup!$C$6)+IF(G132=10,0,Startup!$C$7)+IF(H132=12,0,Startup!$C$8)+IF(I132=14,0,Startup!$C$9)","v":5},{"$f":"IF(J132<>J131,\"Yes\",\"No\")","v":"No"}]
[13.1,1,2,5,6,8,10,12,14,{"$f":"IF(B133=0,0,Startup!$C$2)+IF(C133=2,0,Startup!$C$3)+IF(D133=4,0,Startup!$C$4)+IF(E133=6,0,Startup!$C$5)+IF(F133=8,0,Startup!$C$6)+IF(G133=10,0,Startup!$C$7)+IF(H133=12,0,Startup!$C$8)+IF(I133=14,0,Startup!$C$9)","v":5},"No"]
[13.2,1,2,5,6,8,10,12,14,{"$f":"IF(B134=0,0,Startup!$C$2)+IF(C134=2,0,Startup!$C$3)+IF(D134=4,0,Startup!$C$4)+IF(E134=6,0,Startup!$C$5)+IF(F134=8,0,Startup!$C$6)+IF(G134=10,0,Startup!$C$7)+IF(H134=12,0,Startup!$C$8)+IF(I134=14,0,Startup!$C$9)","v":5},"No"]
[13.3,1,2,5,6,8,10,12,14,{"$f":"IF(B135=0,0,Startup!$C$2)+IF(C135=2,0,Startup!$C$3)+IF(D135=4,0,Startup!$C$4)+IF(E135=6,0,Startup!$C$5)+IF(F135=8,0,Startup!$C$6)+IF(G135=10,0,Startup!$C$7)+IF(H135=12,0,Startup!$C$8)+IF(I135=14,0,Startup!$C$9)","v":5},"No"]
[13.4,1,2,5,6,8,10,12,14,{"$f":"IF(B136=0,0,Startup!$C$2)+IF(C136=2,0,Startup!$C$3)+IF(D136=4,0,Startup!$C$4)+IF(E136=6,0,Startup!$C$5)+IF(F136=8,0,Startup!$C$6)+IF(G136=10,0,Startup!$C$7)+IF(H136=12,0,Startup!$C$8)+IF(I136=14,0,Startup!$C$9)","v":5},"No"]
[13.5,1,2,5,6,8,10,12,14,{"$f":"IF(B137=0,0,Startup!$C$2)+IF(C137=2,0,Startup!$C$3)+IF(D137=4,0,Startup!$C$4)+IF(E137=6,0,Startup!$C$5)+IF(F137=8,0,Startup!$C$6)+IF(G137=10,0,Startup!$C$7)+IF(H137=12,0,Startup!$C$8)+IF(I137=14,0,Startup!$C$9)","v":5},"No"]
[13.6,1,2,5,6,8,10,12,14,{"$f":"IF(B138=0,0,Startup!$C$2)+IF(C138=2,0,Startup!$C$3)+IF(D138=4,0,Startup!$C$4)+IF(E138=6,0,Startup!$C$5)+IF(F138=8,0,Startup!$C$6)+IF(G138=10,0,Startup!$C$7)+IF(H138=12,0,Startup!$C$8)+IF(I138=14,0,Startup!$C$9)","v":5},"No"]
[13.7,1,2,5,6,8,10,12,14,{"$f":"IF(B139=0,0,Startup!$C$2)+IF(C139=2,0,Startup!$C$3)+IF(D139=4,0,Startup!$C$4)+IF(E139=6,0,Startup!$C$5)+IF(F139=8,0,Startup!$C$6)+IF(G139=10,0,Startup!$C$7)+IF(H139=12,0,Startup!$C$8)+IF(I139=14,0,Startup!$C$9)","v":5},"No"]
[13.8,1,2,5,6,8,10,12,14,{"$f":"IF(B140=0,0,Startup!$C$2)+IF(C140=2,0,Startup!$C$3)+IF(D140=4,0,Startup!$C$4)+IF(E140=6,0,Startup!$C$5)+IF(F140=8,0,Startup!$C$6)+IF(G140=10,0,Startup!$C$7)+IF(H140=12,0,Startup!$C$8)+IF(I140=14,0,Startup!$C$9)","v":5},"No"]
[13.9,1,2,5,6,8,10,12,14,{"$f":"IF(B141=0,0,Startup!$C$2)+IF(C141=2,0,Startup!$C$3)+IF(D141=4,0,Startup!$C$4)+IF(E141=6,0,Startup!$C$5)+IF(F141=8,0,Startup!$C$6)+IF(G141=10,0,Startup!$C$7)+IF(H141=12,0,Startup!$C$8)+IF(I141=14,0,Startup!$C$9)","v":5},"No"]
[14,1,2,5,6,8,10,12,14,{"$f":"IF(B142=0,0,Startup!$C$2)+IF(C142=2,0,Startup!$C$3)+IF(D142=4,0,Startup!$C$4)+IF(E142=6,0,Startup!$C$5)+IF(F142=8,0,Startup!$C$6)+IF(G142=10,0,Startup!$C$7)+IF(H142=12,0,Startup!$C$8)+IF(I142=14,0,Startup!$C$9)","v":5},"No"]
[14.1,1,2,5,6,8,10,12,14,{"$f":"IF(B143=0,0,Startup!$C$2)+IF(C143=2,0,Startup!$C$3)+IF(D143=4,0,Startup!$C$4)+IF(E143=6,0,Startup!$C$5)+IF(F143=8,0,Startup!$C$6)+IF(G143=10,0,Startup!$C$7)+IF(H143=12,0,Startup!$C$8)+IF(I143=14,0,Startup!$C$9)","v":5},"No"]
[14.2,1,2,5,6,8,10,12,14,{"$f":"IF(B144=0,0,Startup!$C$2)+IF(C144=2,0,Startup!$C$3)+IF(D144=4,0,Startup!$C$4)+IF(E144=6,0,Startup!$C$5)+IF(F144=8,0,Startup!$C$6)+IF(G144=10,0,Startup!$C$7)+IF(H144=12,0,Startup!$C$8)+IF(I144=14,0,Startup!$C$9)","v":5},"No"]
[14.3,1,2,5,6,8,10,12,14,{"$f":"IF(B145=0,0,Startup!$C$2)+IF(C145=2,0,Startup!$C$3)+IF(D145=4,0,Startup!$C$4)+IF(E145=6,0,Startup!$C$5)+IF(F145=8,0,Startup!$C$6)+IF(G145=10,0,Startup!$C$7)+IF(H145=12,0,Startup!$C$8)+IF(I145=14,0,Startup!$C$9)","v":5},"No"]
[14.4,1,2,5,6,8,10,12,14,{"$f":"IF(B146=0,0,Startup!$C$2)+IF(C146=2,0,Startup!$C$3)+IF(D146=4,0,Startup!$C$4)+IF(E146=6,0,Startup!$C$5)+IF(F146=8,0,Startup!$C$6)+IF(G146=10,0,Startup!$C$7)+IF(H146=12,0,Startup!$C$8)+IF(I146=14,0,Startup!$C$9)","v":5},"No"]
[14.5,1,2,5,6,8,10,12,14,{"$f":"IF(B147=0,0,Startup!$C$2)+IF(C147=2,0,Startup!$C$3)+IF(D147=4,0,Startup!$C$4)+IF(E147=6,0,Startup!$C$5)+IF(F147=8,0,Startup!$C$6)+IF(G147=10,0,Startup!$C$7)+IF(H147=12,0,Startup!$C$8)+IF(I147=14,0,Startup!$C$9)","v":5},"No"]
[14.6,1,2,5,6,8,10,12,14,{"$f":"IF(B148=0,0,Startup!$C$2)+IF(C148=2,0,Startup!$C$3)+IF(D148=4,0,Startup!$C$4)+IF(E148=6,0,Startup!$C$5)+IF(F148=8,0,Startup!$C$6)+IF(G148=10,0,Startup!$C$7)+IF(H148=12,0,Startup!$C$8)+IF(I148=14,0,Startup!$C$9)","v":5},"No"]
[14.7,1,2,5,6,8,10,12,14,{"$f":"IF(B149=0,0,Startup!$C$2)+IF(C149=2,0,Startup!$C$3)+IF(D149=4,0,Startup!$C$4)+IF(E149=6,0,Startup!$C$5)+IF(F149=8,0,Startup!$C$6)+IF(G149=10,0,Startup!$C$7)+IF(H149=12,0,Startup!$C$8)+IF(I149=14,0,Startup!$C$9)","v":5},"No"]
[14.8,1,2,5,6,8,10,12,14,{"$f":"IF(B150=0,0,Startup!$C$2)+IF(C150=2,0,Startup!$C$3)+IF(D150=4,0,Startup!$C$4)+IF(E150=6,0,Startup!$C$5)+IF(F150=8,0,Startup!$C$6)+IF(G150=10,0,Startup!$C$7)+IF(H150=12,0,Startup!$C$8)+IF(I150=14,0,Startup!$C$9)","v":5},"No"]
[14.9,1,2,5,6,8,10,12,14,{"$f":"IF(B151=0,0,Startup!$C$2)+IF(C151=2,0,Startup!$C$3)+IF(D151=4,0,Startup!$C$4)+IF(E151=6,0,Startup!$C$5)+IF(F151=8,0,Startup!$C$6)+IF(G151=10,0,Startup!$C$7)+IF(H151=12,0,Startup!$C$8)+IF(I151=14,0,Startup!$C$9)","v":5},"No"]
[15,1,2,5,6,8,10,12,14,{"$f":"IF(B152=0,0,Startup!$C$2)+IF(C152=2,0,Startup!$C$3)+IF(D152=4,0,Startup!$C$4)+IF(E152=6,0,Startup!$C$5)+IF(F152=8,0,Startup!$C$6)+IF(G152=10,0,Startup!$C$7)+IF(H152=12,0,Startup!$C$8)+IF(I152=14,0,Startup!$C$9)","v":5},"No"]
[15.1,1,2,5,6,8,10,12,14,{"$f":"IF(B153=0,0,Startup!$C$2)+IF(C153=2,0,Startup!$C$3)+IF(D153=4,0,Startup!$C$4)+IF(E153=6,0,Startup!$C$5)+IF(F153=8,0,Startup!$C$6)+IF(G153=10,0,Startup!$C$7)+IF(H153=12,0,Startup!$C$8)+IF(I153=14,0,Startup!$C$9)","v":5},"No"]
[15.2,1,2,5,6,8,10,12,14,{"$f":"IF(B154=0,0,Startup!$C$2)+IF(C154=2,0,Startup!$C$3)+IF(D154=4,0,Startup!$C$4)+IF(E154=6,0,Startup!$C$5)+IF(F154=8,0,Startup!$C$6)+IF(G154=10,0,Startup!$C$7)+IF(H154=12,0,Startup!$C$8)+IF(I154=14,0,Startup!$C$9)","v":5},"No"]
[15.3,1,2,5,6,8,10,12,14,{"$f":"IF(B155=0,0,Startup!$C$2)+IF(C155=2,0,Startup!$C$3)+IF(D155=4,0,Startup!$C$4)+IF(E155=6,0,Startup!$C$5)+IF(F155=8,0,Startup!$C$6)+IF(G155=10,0,Startup!$C$7)+IF(H155=12,0,Startup!$C$8)+IF(I155=14,0,Startup!$C$9)","v":5},"No"]
[15.4,1,2,5,6,8,10,12,14,{"$f":"IF(B156=0,0,Startup!$C$2)+IF(C156=2,0,Startup!$C$3)+IF(D156=4,0,Startup!$C$4)+IF(E156=6,0,Startup!$C$5)+IF(F156=8,0,Startup!$C$6)+IF(G156=10,0,Startup!$C$7)+IF(H156=12,0,Startup!$C$8)+IF(I156=14,0,Startup!$C$9)","v":5},"No"]
[15.5,1,2,5,6,8,10,12,14,{"$f":"IF(B157=0,0,Startup!$C$2)+IF(C157=2,0,Startup!$C$3)+IF(D157=4,0,Startup!$C$4)+IF(E157=6,0,Startup!$C$5)+IF(F157=8,0,Startup!$C$6)+IF(G157=10,0,Startup!$C$7)+IF(H157=12,0,Startup!$C$8)+IF(I157=14,0,Startup!$C$9)","v":5},"No"]
[15.6,1,2,5,6,8,10,12,14,{"$f":"IF(B158=0,0,Startup!$C$2)+IF(C158=2,0,Startup!$C$3)+IF(D158=4,0,Startup!$C$4)+IF(E158=6,0,Startup!$C$5)+IF(F158=8,0,Startup!$C$6)+IF(G158=10,0,Startup!$C$7)+IF(H158=12,0,Startup!$C$8)+IF(I158=14,0,Startup!$C$9)","v":5},"No"]
[15.7,1,2,5,6,8,10,12,14,{"$f":"IF(B159=0,0,Startup!$C$2)+IF(C159=2,0,Startup!$C$3)+IF(D159=4,0,Startup!$C$4)+IF(E159=6,0,Startup!$C$5)+IF(F159=8,0,Startup!$C$6)+IF(G159=10,0,Startup!$C$7)+IF(H159=12,0,Startup!$C$8)+IF(I159=14,0,Startup!$C$9)","v":5},"No"]
[15.8,1,2,5,6,8,10,12,14,{"$f":"IF(B160=0,0,Startup!$C$2)+IF(C160=2,0,Startup!$C$3)+IF(D160=4,0,Startup!$C$4)+IF(E160=6,0,Startup!$C$5)+IF(F160=8,0,Startup!$C$6)+IF(G160=10,0,Startup!$C$7)+IF(H160=12,0,Startup!$C$8)+IF(I160=14,0,Startup!$C$9)","v":5},"No"]
[15.9,1,2,5,6,8,10,12,14,{"$f":"IF(B161=0,0,Startup!$C$2)+IF(C161=2,0,Startup!$C$3)+IF(D161=4,0,Startup!$C$4)+IF(E161=6,0,Startup!$C$5)+IF(F161=8,0,Startup!$C$6)+IF(G161=10,0,Startup!$C$7)+IF(H161=12,0,Startup!$C$8)+IF(I161=14,0,Startup!$C$9)","v":5},"No"]
[16,1,2,5,6,8,10,12,14,{"$f":"IF(B162=0,0,Startup!$C$2)+IF(C162=2,0,Startup!$C$3)+IF(D162=4,0,Startup!$C$4)+IF(E162=6,0,Startup!$C$5)+IF(F162=8,0,Startup!$C$6)+IF(G162=10,0,Startup!$C$7)+IF(H162=12,0,Startup!$C$8)+IF(I162=14,0,Startup!$C$9)","v":5},"No"]
[16.100000000000001,1,2,5,6,8,10,12,14,{"$f":"IF(B163=0,0,Startup!$C$2)+IF(C163=2,0,Startup!$C$3)+IF(D163=4,0,Startup!$C$4)+IF(E163=6,0,Startup!$C$5)+IF(F163=8,0,Startup!$C$6)+IF(G163=10,0,Startup!$C$7)+IF(H163=12,0,Startup!$C$8)+IF(I163=14,0,Startup!$C$9)","v":5},"No"]
[16.2,1,2,5,6,8,10,12,14,{"$f":"IF(B164=0,0,Startup!$C$2)+IF(C164=2,0,Startup!$C$3)+IF(D164=4,0,Startup!$C$4)+IF(E164=6,0,Startup!$C$5)+IF(F164=8,0,Startup!$C$6)+IF(G164=10,0,Startup!$C$7)+IF(H164=12,0,Startup!$C$8)+IF(I164=14,0,Startup!$C$9)","v":5},"No"]
[16.3,1,2,5,6,8,10,12,14,{"$f":"IF(B165=0,0,Startup!$C$2)+IF(C165=2,0,Startup!$C$3)+IF(D165=4,0,Startup!$C$4)+IF(E165=6,0,Startup!$C$5)+IF(F165=8,0,Startup!$C$6)+IF(G165=10,0,Startup!$C$7)+IF(H165=12,0,Startup!$C$8)+IF(I165=14,0,Startup!$C$9)","v":5},"No"]
[16.399999999999999,1,2,5,6,8,10,12,14,{"$f":"IF(B166=0,0,Startup!$C$2)+IF(C166=2,0,Startup!$C$3)+IF(D166=4,0,Startup!$C$4)+IF(E166=6,0,Startup!$C$5)+IF(F166=8,0,Startup!$C$6)+IF(G166=10,0,Startup!$C$7)+IF(H166=12,0,Startup!$C$8)+IF(I166=14,0,Startup!$C$9)","v":5},"No"]
[16.5,1,2,5,6,8,10,12,14,{"$f":"IF(B167=0,0,Startup!$C$2)+IF(C167=2,0,Startup!$C$3)+IF(D167=4,0,Startup!$C$4)+IF(E167=6,0,Startup!$C$5)+IF(F167=8,0,Startup!$C$6)+IF(G167=10,0,Startup!$C$7)+IF(H167=12,0,Startup!$C$8)+IF(I167=14,0,Startup!$C$9)","v":5},"No"]
[16.600000000000001,1,2,5,6,8,10,12,14,{"$f":"IF(B168=0,0,Startup!$C$2)+IF(C168=2,0,Startup!$C$3)+IF(D168=4,0,Startup!$C$4)+IF(E168=6,0,Startup!$C$5)+IF(F168=8,0,Startup!$C$6)+IF(G168=10,0,Startup!$C$7)+IF(H168=12,0,Startup!$C$8)+IF(I168=14,0,Startup!$C$9)","v":5},"No"]
[16.7,1,2,5,6,8,10,12,14,{"$f":"IF(B169=0,0,Startup!$C$2)+IF(C169=2,0,Startup!$C$3)+IF(D169=4,0,Startup!$C$4)+IF(E169=6,0,Startup!$C$5)+IF(F169=8,0,Startup!$C$6)+IF(G169=10,0,Startup!$C$7)+IF(H169=12,0,Startup!$C$8)+IF(I169=14,0,Startup!$C$9)","v":5},"No"]
[16.8,1,2,5,6,8,10,12,14,{"$f":"IF(B170=0,0,Startup!$C$2)+IF(C170=2,0,Startup!$C$3)+IF(D170=4,0,Startup!$C$4)+IF(E170=6,0,Startup!$C$5)+IF(F170=8,0,Startup!$C$6)+IF(G170=10,0,Startup!$C$7)+IF(H170=12,0,Startup!$C$8)+IF(I170=14,0,Startup!$C$9)","v":5},"No"]
[16.899999999999999,1,2,5,6,8,10,12,14,{"$f":"IF(B171=0,0,Startup!$C$2)+IF(C171=2,0,Startup!$C$3)+IF(D171=4,0,Startup!$C$4)+IF(E171=6,0,Startup!$C$5)+IF(F171=8,0,Startup!$C$6)+IF(G171=10,0,Startup!$C$7)+IF(H171=12,0,Startup!$C$8)+IF(I171=14,0,Startup!$C$9)","v":5},"No"]
[17,1,2,5,6,8,10,12,14,{"$f":"IF(B172=0,0,Startup!$C$2)+IF(C172=2,0,Startup!$C$3)+IF(D172=4,0,Startup!$C$4)+IF(E172=6,0,Startup!$C$5)+IF(F172=8,0,Startup!$C$6)+IF(G172=10,0,Startup!$C$7)+IF(H172=12,0,Startup!$C$8)+IF(I172=14,0,Startup!$C$9)","v":5},"No"]
[17.100000000000001,1,2,5,6,8,10,12,14,{"$f":"IF(B173=0,0,Startup!$C$2)+IF(C173=2,0,Startup!$C$3)+IF(D173=4,0,Startup!$C$4)+IF(E173=6,0,Startup!$C$5)+IF(F173=8,0,Startup!$C$6)+IF(G173=10,0,Startup!$C$7)+IF(H173=12,0,Startup!$C$8)+IF(I173=14,0,Startup!$C$9)","v":5},"No"]
[17.2,1,2,5,6,8,10,12,14,{"$f":"IF(B174=0,0,Startup!$C$2)+IF(C174=2,0,Startup!$C$3)+IF(D174=4,0,Startup!$C$4)+IF(E174=6,0,Startup!$C$5)+IF(F174=8,0,Startup!$C$6)+IF(G174=10,0,Startup!$C$7)+IF(H174=12,0,Startup!$C$8)+IF(I174=14,0,Startup!$C$9)","v":5},"No"]
[17.3,1,2,5,6,8,10,12,14,{"$f":"IF(B175=0,0,Startup!$C$2)+IF(C175=2,0,Startup!$C$3)+IF(D175=4,0,Startup!$C$4)+IF(E175=6,0,Startup!$C$5)+IF(F175=8,0,Startup!$C$6)+IF(G175=10,0,Startup!$C$7)+IF(H175=12,0,Startup!$C$8)+IF(I175=14,0,Startup!$C$9)","v":5},"No"]
[17.399999999999999,1,2,5,6,8,10,12,14,{"$f":"IF(B176=0,0,Startup!$C$2)+IF(C176=2,0,Startup!$C$3)+IF(D176=4,0,Startup!$C$4)+IF(E176=6,0,Startup!$C$5)+IF(F176=8,0,Startup!$C$6)+IF(G176=10,0,Startup!$C$7)+IF(H176=12,0,Startup!$C$8)+IF(I176=14,0,Startup!$C$9)","v":5},"No"]
[17.5,1,2,5,6,8,10,12,14,{"$f":"IF(B177=0,0,Startup!$C$2)+IF(C177=2,0,Startup!$C$3)+IF(D177=4,0,Startup!$C$4)+IF(E177=6,0,Startup!$C$5)+IF(F177=8,0,Startup!$C$6)+IF(G177=10,0,Startup!$C$7)+IF(H177=12,0,Startup!$C$8)+IF(I177=14,0,Startup!$C$9)","v":5},"No"]
[17.600000000000001,1,2,5,6,8,10,12,14,{"$f":"IF(B178=0,0,Startup!$C$2)+IF(C178=2,0,Startup!$C$3)+IF(D178=4,0,Startup!$C$4)+IF(E178=6,0,Startup!$C$5)+IF(F178=8,0,Startup!$C$6)+IF(G178=10,0,Startup!$C$7)+IF(H178=12,0,Startup!$C$8)+IF(I178=14,0,Startup!$C$9)","v":5},"No"]
[17.7,1,2,5,6,8,10,12,14,{"$f":"IF(B179=0,0,Startup!$C$2)+IF(C179=2,0,Startup!$C$3)+IF(D179=4,0,Startup!$C$4)+IF(E179=6,0,Startup!$C$5)+IF(F179=8,0,Startup!$C$6)+IF(G179=10,0,Startup!$C$7)+IF(H179=12,0,Startup!$C$8)+IF(I179=14,0,Startup!$C$9)","v":5},"No"]
[17.8,1,2,5,6,8,10,12,14,{"$f":"IF(B180=0,0,Startup!$C$2)+IF(C180=2,0,Startup!$C$3)+IF(D180=4,0,Startup!$C$4)+IF(E180=6,0,Startup!$C$5)+IF(F180=8,0,Startup!$C$6)+IF(G180=10,0,Startup!$C$7)+IF(H180=12,0,Startup!$C$8)+IF(I180=14,0,Startup!$C$9)","v":5},"No"]
[17.899999999999999,1,2,5,6,8,10,12,14,{"$f":"IF(B181=0,0,Startup!$C$2)+IF(C181=2,0,Startup!$C$3)+IF(D181=4,0,Startup!$C$4)+IF(E181=6,0,Startup!$C$5)+IF(F181=8,0,Startup!$C$6)+IF(G181=10,0,Startup!$C$7)+IF(H181=12,0,Startup!$C$8)+IF(I181=14,0,Startup!$C$9)","v":5},"No"]
[18,1,2,5,6,8,10,12,14,{"$f":"IF(B182=0,0,Startup!$C$2)+IF(C182=2,0,Startup!$C$3)+IF(D182=4,0,Startup!$C$4)+IF(E182=6,0,Startup!$C$5)+IF(F182=8,0,Startup!$C$6)+IF(G182=10,0,Startup!$C$7)+IF(H182=12,0,Startup!$C$8)+IF(I182=14,0,Startup!$C$9)","v":5},"No"]
[18.100000000000001,1,2,5,6,8,10,12,14,{"$f":"IF(B183=0,0,Startup!$C$2)+IF(C183=2,0,Startup!$C$3)+IF(D183=4,0,Startup!$C$4)+IF(E183=6,0,Startup!$C$5)+IF(F183=8,0,Startup!$C$6)+IF(G183=10,0,Startup!$C$7)+IF(H183=12,0,Startup!$C$8)+IF(I183=14,0,Startup!$C$9)","v":5},"No"]
[18.2,1,2,5,6,8,10,12,14,{"$f":"IF(B184=0,0,Startup!$C$2)+IF(C184=2,0,Startup!$C$3)+IF(D184=4,0,Startup!$C$4)+IF(E184=6,0,Startup!$C$5)+IF(F184=8,0,Startup!$C$6)+IF(G184=10,0,Startup!$C$7)+IF(H184=12,0,Startup!$C$8)+IF(I184=14,0,Startup!$C$9)","v":5},"No"]
[18.3,1,2,5,6,8,10,12,14,{"$f":"IF(B185=0,0,Startup!$C$2)+IF(C185=2,0,Startup!$C$3)+IF(D185=4,0,Startup!$C$4)+IF(E185=6,0,Startup!$C$5)+IF(F185=8,0,Startup!$C$6)+IF(G185=10,0,Startup!$C$7)+IF(H185=12,0,Startup!$C$8)+IF(I185=14,0,Startup!$C$9)","v":5},"No"]
[18.399999999999999,1,2,5,6,8,10,12,14,{"$f":"IF(B186=0,0,Startup!$C$2)+IF(C186=2,0,Startup!$C$3)+IF(D186=4,0,Startup!$C$4)+IF(E186=6,0,Startup!$C$5)+IF(F186=8,0,Startup!$C$6)+IF(G186=10,0,Startup!$C$7)+IF(H186=12,0,Startup!$C$8)+IF(I186=14,0,Startup!$C$9)","v":5},"No"]
[18.5,1,2,5,6,8,10,12,14,{"$f":"IF(B187=0,0,Startup!$C$2)+IF(C187=2,0,Startup!$C$3)+IF(D187=4,0,Startup!$C$4)+IF(E187=6,0,Startup!$C$5)+IF(F187=8,0,Startup!$C$6)+IF(G187=10,0,Startup!$C$7)+IF(H187=12,0,Startup!$C$8)+IF(I187=14,0,Startup!$C$9)","v":5},"No"]
[18.600000000000001,1,2,5,6,8,10,12,14,{"$f":"IF(B188=0,0,Startup!$C$2)+IF(C188=2,0,Startup!$C$3)+IF(D188=4,0,Startup!$C$4)+IF(E188=6,0,Startup!$C$5)+IF(F188=8,0,Startup!$C$6)+IF(G188=10,0,Startup!$C$7)+IF(H188=12,0,Startup!$C$8)+IF(I188=14,0,Startup!$C$9)","v":5},"No"]
[18.7,1,2,5,6,8,10,12,14,{"$f":"IF(B189=0,0,Startup!$C$2)+IF(C189=2,0,Startup!$C$3)+IF(D189=4,0,Startup!$C$4)+IF(E189=6,0,Startup!$C$5)+IF(F189=8,0,Startup!$C$6)+IF(G189=10,0,Startup!$C$7)+IF(H189=12,0,Startup!$C$8)+IF(I189=14,0,Startup!$C$9)","v":5},"No"]
[18.8,1,2,5,6,8,10,12,14,{"$f":"IF(B190=0,0,Startup!$C$2)+IF(C190=2,0,Startup!$C$3)+IF(D190=4,0,Startup!$C$4)+IF(E190=6,0,Startup!$C$5)+IF(F190=8,0,Startup!$C$6)+IF(G190=10,0,Startup!$C$7)+IF(H190=12,0,Startup!$C$8)+IF(I190=14,0,Startup!$C$9)","v":5},"No"]
[18.899999999999999,1,2,5,6,8,10,12,14,{"$f":"IF(B191=0,0,Startup!$C$2)+IF(C191=2,0,Startup!$C$3)+IF(D191=4,0,Startup!$C$4)+IF(E191=6,0,Startup!$C$5)+IF(F191=8,0,Startup!$C$6)+IF(G191=10,0,Startup!$C$7)+IF(H191=12,0,Startup!$C$8)+IF(I191=14,0,Startup!$C$9)","v":5},"No"]
[19,1,2,5,6,8,10,12,14,{"$f":"IF(B192=0,0,Startup!$C$2)+IF(C192=2,0,Startup!$C$3)+IF(D192=4,0,Startup!$C$4)+IF(E192=6,0,Startup!$C$5)+IF(F192=8,0,Startup!$C$6)+IF(G192=10,0,Startup!$C$7)+IF(H192=12,0,Startup!$C$8)+IF(I192=14,0,Startup!$C$9)","v":5},"No"]
[19.100000000000001,1,2,5,6,8,10,12,14,{"$f":"IF(B193=0,0,Startup!$C$2)+IF(C193=2,0,Startup!$C$3)+IF(D193=4,0,Startup!$C$4)+IF(E193=6,0,Startup!$C$5)+IF(F193=8,0,Startup!$C$6)+IF(G193=10,0,Startup!$C$7)+IF(H193=12,0,Startup!$C$8)+IF(I193=14,0,Startup!$C$9)","v":5},"No"]
[19.2,1,2,5,6,8,10,12,14,{"$f":"IF(B194=0,0,Startup!$C$2)+IF(C194=2,0,Startup!$C$3)+IF(D194=4,0,Startup!$C$4)+IF(E194=6,0,Startup!$C$5)+IF(F194=8,0,Startup!$C$6)+IF(G194=10,0,Startup!$C$7)+IF(H194=12,0,Startup!$C$8)+IF(I194=14,0,Startup!$C$9)","v":5},"No"]
[19.3,1,2,5,6,8,10,12,14,{"$f":"IF(B195=0,0,Startup!$C$2)+IF(C195=2,0,Startup!$C$3)+IF(D195=4,0,Startup!$C$4)+IF(E195=6,0,Startup!$C$5)+IF(F195=8,0,Startup!$C$6)+IF(G195=10,0,Startup!$C$7)+IF(H195=12,0,Startup!$C$8)+IF(I195=14,0,Startup!$C$9)","v":5},"No"]
[19.399999999999999,1,2,5,6,8,10,12,14,{"$f":"IF(B196=0,0,Startup!$C$2)+IF(C196=2,0,Startup!$C$3)+IF(D196=4,0,Startup!$C$4)+IF(E196=6,0,Startup!$C$5)+IF(F196=8,0,Startup!$C$6)+IF(G196=10,0,Startup!$C$7)+IF(H196=12,0,Startup!$C$8)+IF(I196=14,0,Startup!$C$9)","v":5},{"$f":"IF(J196<>J195,\"Yes\",\"No\")","v":"No"}]
[19.5,1,2,5,6,8,10,12,14,{"$f":"IF(B197=0,0,Startup!$C$2)+IF(C197=2,0,Startup!$C$3)+IF(D197=4,0,Startup!$C$4)+IF(E197=6,0,Startup!$C$5)+IF(F197=8,0,Startup!$C$6)+IF(G197=10,0,Startup!$C$7)+IF(H197=12,0,Startup!$C$8)+IF(I197=14,0,Startup!$C$9)","v":5},"No"]
[19.600000000000001,1,2,5,6,8,10,12,14,{"$f":"IF(B198=0,0,Startup!$C$2)+IF(C198=2,0,Startup!$C$3)+IF(D198=4,0,Startup!$C$4)+IF(E198=6,0,Startup!$C$5)+IF(F198=8,0,Startup!$C$6)+IF(G198=10,0,Startup!$C$7)+IF(H198=12,0,Startup!$C$8)+IF(I198=14,0,Startup!$C$9)","v":5},"No"]
[19.7,1,2,5,6,8,10,12,14,{"$f":"IF(B199=0,0,Startup!$C$2)+IF(C199=2,0,Startup!$C$3)+IF(D199=4,0,Startup!$C$4)+IF(E199=6,0,Startup!$C$5)+IF(F199=8,0,Startup!$C$6)+IF(G199=10,0,Startup!$C$7)+IF(H199=12,0,Startup!$C$8)+IF(I199=14,0,Startup!$C$9)","v":5},"No"]
[19.8,1,2,5,6,8,10,12,14,{"$f":"IF(B200=0,0,Startup!$C$2)+IF(C200=2,0,Startup!$C$3)+IF(D200=4,0,Startup!$C$4)+IF(E200=6,0,Startup!$C$5)+IF(F200=8,0,Startup!$C$6)+IF(G200=10,0,Startup!$C$7)+IF(H200=12,0,Startup!$C$8)+IF(I200=14,0,Startup!$C$9)","v":5},"No"]
[19.899999999999999,1,2,5,6,8,10,12,14,{"$f":"IF(B201=0,0,Startup!$C$2)+IF(C201=2,0,Startup!$C$3)+IF(D201=4,0,Startup!$C$4)+IF(E201=6,0,Startup!$C$5)+IF(F201=8,0,Startup!$C$6)+IF(G201=10,0,Startup!$C$7)+IF(H201=12,0,Startup!$C$8)+IF(I201=14,0,Startup!$C$9)","v":5},"No"]
[20,1,2,4,6,8,10,12,14,{"$f":"IF(B202=0,0,Startup!$C$2)+IF(C202=2,0,Startup!$C$3)+IF(D202=4,0,Startup!$C$4)+IF(E202=6,0,Startup!$C$5)+IF(F202=8,0,Startup!$C$6)+IF(G202=10,0,Startup!$C$7)+IF(H202=12,0,Startup!$C$8)+IF(I202=14,0,Startup!$C$9)","v":1},"Yes"]
[20.100000000000001,1,2,4,6,8,10,12,14,{"$f":"IF(B203=0,0,Startup!$C$2)+IF(C203=2,0,Startup!$C$3)+IF(D203=4,0,Startup!$C$4)+IF(E203=6,0,Startup!$C$5)+IF(F203=8,0,Startup!$C$6)+IF(G203=10,0,Startup!$C$7)+IF(H203=12,0,Startup!$C$8)+IF(I203=14,0,Startup!$C$9)","v":1},"No"]
[20.2,1,2,4,6,8,10,12,14,{"$f":"IF(B204=0,0,Startup!$C$2)+IF(C204=2,0,Startup!$C$3)+IF(D204=4,0,Startup!$C$4)+IF(E204=6,0,Startup!$C$5)+IF(F204=8,0,Startup!$C$6)+IF(G204=10,0,Startup!$C$7)+IF(H204=12,0,Startup!$C$8)+IF(I204=14,0,Startup!$C$9)","v":1},"No"]
[20.3,1,2,4,6,8,10,12,14,{"$f":"IF(B205=0,0,Startup!$C$2)+IF(C205=2,0,Startup!$C$3)+IF(D205=4,0,Startup!$C$4)+IF(E205=6,0,Startup!$C$5)+IF(F205=8,0,Startup!$C$6)+IF(G205=10,0,Startup!$C$7)+IF(H205=12,0,Startup!$C$8)+IF(I205=14,0,Startup!$C$9)","v":1},"No"]
[20.399999999999999,1,2,4,6,8,10,12,14,{"$f":"IF(B206=0,0,Startup!$C$2)+IF(C206=2,0,Startup!$C$3)+IF(D206=4,0,Startup!$C$4)+IF(E206=6,0,Startup!$C$5)+IF(F206=8,0,Startup!$C$6)+IF(G206=10,0,Startup!$C$7)+IF(H206=12,0,Startup!$C$8)+IF(I206=14,0,Startup!$C$9)","v":1},"No"]
[20.5,1,2,4,6,8,10,12,14,{"$f":"IF(B207=0,0,Startup!$C$2)+IF(C207=2,0,Startup!$C$3)+IF(D207=4,0,Startup!$C$4)+IF(E207=6,0,Startup!$C$5)+IF(F207=8,0,Startup!$C$6)+IF(G207=10,0,Startup!$C$7)+IF(H207=12,0,Startup!$C$8)+IF(I207=14,0,Startup!$C$9)","v":1},"No"]
[20.6,1,2,4,6,8,10,12,14,{"$f":"IF(B208=0,0,Startup!$C$2)+IF(C208=2,0,Startup!$C$3)+IF(D208=4,0,Startup!$C$4)+IF(E208=6,0,Startup!$C$5)+IF(F208=8,0,Startup!$C$6)+IF(G208=10,0,Startup!$C$7)+IF(H208=12,0,Startup!$C$8)+IF(I208=14,0,Startup!$C$9)","v":1},"No"]
[20.7,1,2,4,6,8,10,12,14,{"$f":"IF(B209=0,0,Startup!$C$2)+IF(C209=2,0,Startup!$C$3)+IF(D209=4,0,Startup!$C$4)+IF(E209=6,0,Startup!$C$5)+IF(F209=8,0,Startup!$C$6)+IF(G209=10,0,Startup!$C$7)+IF(H209=12,0,Startup!$C$8)+IF(I209=14,0,Startup!$C$9)","v":1},"No"]
[20.8,1,2,4,6,8,10,12,14,{"$f":"IF(B210=0,0,Startup!$C$2)+IF(C210=2,0,Startup!$C$3)+IF(D210=4,0,Startup!$C$4)+IF(E210=6,0,Startup!$C$5)+IF(F210=8,0,Startup!$C$6)+IF(G210=10,0,Startup!$C$7)+IF(H210=12,0,Startup!$C$8)+IF(I210=14,0,Startup!$C$9)","v":1},"No"]
[20.9,1,2,4,6,8,10,12,14,{"$f":"IF(B211=0,0,Startup!$C$2)+IF(C211=2,0,Startup!$C$3)+IF(D211=4,0,Startup!$C$4)+IF(E211=6,0,Startup!$C$5)+IF(F211=8,0,Startup!$C$6)+IF(G211=10,0,Startup!$C$7)+IF(H211=12,0,Startup!$C$8)+IF(I211=14,0,Startup!$C$9)","v":1},"No"]
[21,0,2,4,6,8,10,12,14,{"$f":"IF(B212=0,0,Startup!$C$2)+IF(C212=2,0,Startup!$C$3)+IF(D212=4,0,Startup!$C$4)+IF(E212=6,0,Startup!$C$5)+IF(F212=8,0,Startup!$C$6)+IF(G212=10,0,Startup!$C$7)+IF(H212=12,0,Startup!$C$8)+IF(I212=14,0,Startup!$C$9)","v":0},"Yes"]
[21.1,0,2,4,6,8,10,12,14,{"$f":"IF(B213=0,0,Startup!$C$2)+IF(C213=2,0,Startup!$C$3)+IF(D213=4,0,Startup!$C$4)+IF(E213=6,0,Startup!$C$5)+IF(F213=8,0,Startup!$C$6)+IF(G213=10,0,Startup!$C$7)+IF(H213=12,0,Startup!$C$8)+IF(I213=14,0,Startup!$C$9)","v":0},"No"]
[21.2,0,2,4,6,8,10,12,14,{"$f":"IF(B214=0,0,Startup!$C$2)+IF(C214=2,0,Startup!$C$3)+IF(D214=4,0,Startup!$C$4)+IF(E214=6,0,Startup!$C$5)+IF(F214=8,0,Startup!$C$6)+IF(G214=10,0,Startup!$C$7)+IF(H214=12,0,Startup!$C$8)+IF(I214=14,0,Startup!$C$9)","v":0},"No"]
[21.3,0,2,4,6,8,10,12,14,{"$f":"IF(B215=0,0,Startup!$C$2)+IF(C215=2,0,Startup!$C$3)+IF(D215=4,0,Startup!$C$4)+IF(E215=6,0,Startup!$C$5)+IF(F215=8,0,Startup!$C$6)+IF(G215=10,0,Startup!$C$7)+IF(H215=12,0,Startup!$C$8)+IF(I215=14,0,Startup!$C$9)","v":0},"No"]
[21.4,0,2,4,6,8,10,12,14,{"$f":"IF(B216=0,0,Startup!$C$2)+IF(C216=2,0,Startup!$C$3)+IF(D216=4,0,Startup!$C$4)+IF(E216=6,0,Startup!$C$5)+IF(F216=8,0,Startup!$C$6)+IF(G216=10,0,Startup!$C$7)+IF(H216=12,0,Startup!$C$8)+IF(I216=14,0,Startup!$C$9)","v":0},"No"]
[21.5,0,2,4,6,8,10,12,14,{"$f":"IF(B217=0,0,Startup!$C$2)+IF(C217=2,0,Startup!$C$3)+IF(D217=4,0,Startup!$C$4)+IF(E217=6,0,Startup!$C$5)+IF(F217=8,0,Startup!$C$6)+IF(G217=10,0,Startup!$C$7)+IF(H217=12,0,Startup!$C$8)+IF(I217=14,0,Startup!$C$9)","v":0},"No"]
[21.6,0,2,4,6,8,10,12,14,{"$f":"IF(B218=0,0,Startup!$C$2)+IF(C218=2,0,Startup!$C$3)+IF(D218=4,0,Startup!$C$4)+IF(E218=6,0,Startup!$C$5)+IF(F218=8,0,Startup!$C$6)+IF(G218=10,0,Startup!$C$7)+IF(H218=12,0,Startup!$C$8)+IF(I218=14,0,Startup!$C$9)","v":0},"No"]
[21.7,0,2,4,6,8,10,12,14,{"$f":"IF(B219=0,0,Startup!$C$2)+IF(C219=2,0,Startup!$C$3)+IF(D219=4,0,Startup!$C$4)+IF(E219=6,0,Startup!$C$5)+IF(F219=8,0,Startup!$C$6)+IF(G219=10,0,Startup!$C$7)+IF(H219=12,0,Startup!$C$8)+IF(I219=14,0,Startup!$C$9)","v":0},"No"]
[21.8,0,2,4,6,8,10,12,14,{"$f":"IF(B220=0,0,Startup!$C$2)+IF(C220=2,0,Startup!$C$3)+IF(D220=4,0,Startup!$C$4)+IF(E220=6,0,Startup!$C$5)+IF(F220=8,0,Startup!$C$6)+IF(G220=10,0,Startup!$C$7)+IF(H220=12,0,Startup!$C$8)+IF(I220=14,0,Startup!$C$9)","v":0},"No"]
[21.9,0,2,4,6,8,10,12,14,{"$f":"IF(B221=0,0,Startup!$C$2)+IF(C221=2,0,Startup!$C$3)+IF(D221=4,0,Startup!$C$4)+IF(E221=6,0,Startup!$C$5)+IF(F221=8,0,Startup!$C$6)+IF(G221=10,0,Startup!$C$7)+IF(H221=12,0,Startup!$C$8)+IF(I221=14,0,Startup!$C$9)","v":0},"No"]
[22,0,2,4,6,8,10,12,14,{"$f":"IF(B222=0,0,Startup!$C$2)+IF(C222=2,0,Startup!$C$3)+IF(D222=4,0,Startup!$C$4)+IF(E222=6,0,Startup!$C$5)+IF(F222=8,0,Startup!$C$6)+IF(G222=10,0,Startup!$C$7)+IF(H222=12,0,Startup!$C$8)+IF(I222=14,0,Startup!$C$9)","v":0},"No"]
[22.1,0,2,4,6,8,10,12,14,{"$f":"IF(B223=0,0,Startup!$C$2)+IF(C223=2,0,Startup!$C$3)+IF(D223=4,0,Startup!$C$4)+IF(E223=6,0,Startup!$C$5)+IF(F223=8,0,Startup!$C$6)+IF(G223=10,0,Startup!$C$7)+IF(H223=12,0,Startup!$C$8)+IF(I223=14,0,Startup!$C$9)","v":0},"No"]
[22.2,0,2,4,6,8,10,12,14,{"$f":"IF(B224=0,0,Startup!$C$2)+IF(C224=2,0,Startup!$C$3)+IF(D224=4,0,Startup!$C$4)+IF(E224=6,0,Startup!$C$5)+IF(F224=8,0,Startup!$C$6)+IF(G224=10,0,Startup!$C$7)+IF(H224=12,0,Startup!$C$8)+IF(I224=14,0,Startup!$C$9)","v":0},"No"]
[22.3,0,2,4,6,8,10,12,14,{"$f":"IF(B225=0,0,Startup!$C$2)+IF(C225=2,0,Startup!$C$3)+IF(D225=4,0,Startup!$C$4)+IF(E225=6,0,Startup!$C$5)+IF(F225=8,0,Startup!$C$6)+IF(G225=10,0,Startup!$C$7)+IF(H225=12,0,Startup!$C$8)+IF(I225=14,0,Startup!$C$9)","v":0},"No"]
[22.4,0,2,4,6,8,10,12,14,{"$f":"IF(B226=0,0,Startup!$C$2)+IF(C226=2,0,Startup!$C$3)+IF(D226=4,0,Startup!$C$4)+IF(E226=6,0,Startup!$C$5)+IF(F226=8,0,Startup!$C$6)+IF(G226=10,0,Startup!$C$7)+IF(H226=12,0,Startup!$C$8)+IF(I226=14,0,Startup!$C$9)","v":0},"No"]
[22.5,0,2,4,6,8,10,12,14,{"$f":"IF(B227=0,0,Startup!$C$2)+IF(C227=2,0,Startup!$C$3)+IF(D227=4,0,Startup!$C$4)+IF(E227=6,0,Startup!$C$5)+IF(F227=8,0,Startup!$C$6)+IF(G227=10,0,Startup!$C$7)+IF(H227=12,0,Startup!$C$8)+IF(I227=14,0,Startup!$C$9)","v":0},"No"]
[22.6,0,2,4,6,8,10,12,14,{"$f":"IF(B228=0,0,Startup!$C$2)+IF(C228=2,0,Startup!$C$3)+IF(D228=4,0,Startup!$C$4)+IF(E228=6,0,Startup!$C$5)+IF(F228=8,0,Startup!$C$6)+IF(G228=10,0,Startup!$C$7)+IF(H228=12,0,Startup!$C$8)+IF(I228=14,0,Startup!$C$9)","v":0},"No"]
[22.7,0,2,4,6,8,10,12,14,{"$f":"IF(B229=0,0,Startup!$C$2)+IF(C229=2,0,Startup!$C$3)+IF(D229=4,0,Startup!$C$4)+IF(E229=6,0,Startup!$C$5)+IF(F229=8,0,Startup!$C$6)+IF(G229=10,0,Startup!$C$7)+IF(H229=12,0,Startup!$C$8)+IF(I229=14,0,Startup!$C$9)","v":0},"No"]
[22.8,0,2,4,6,8,10,12,14,{"$f":"IF(B230=0,0,Startup!$C$2)+IF(C230=2,0,Startup!$C$3)+IF(D230=4,0,Startup!$C$4)+IF(E230=6,0,Startup!$C$5)+IF(F230=8,0,Startup!$C$6)+IF(G230=10,0,Startup!$C$7)+IF(H230=12,0,Startup!$C$8)+IF(I230=14,0,Startup!$C$9)","v":0},"No"]
[22.9,0,2,4,6,8,10,12,14,{"$f":"IF(B231=0,0,Startup!$C$2)+IF(C231=2,0,Startup!$C$3)+IF(D231=4,0,Startup!$C$4)+IF(E231=6,0,Startup!$C$5)+IF(F231=8,0,Startup!$C$6)+IF(G231=10,0,Startup!$C$7)+IF(H231=12,0,Startup!$C$8)+IF(I231=14,0,Startup!$C$9)","v":0},"No"]
[23,0,2,4,6,8,10,12,14,{"$f":"IF(B232=0,0,Startup!$C$2)+IF(C232=2,0,Startup!$C$3)+IF(D232=4,0,Startup!$C$4)+IF(E232=6,0,Startup!$C$5)+IF(F232=8,0,Startup!$C$6)+IF(G232=10,0,Startup!$C$7)+IF(H232=12,0,Startup!$C$8)+IF(I232=14,0,Startup!$C$9)","v":0},"No"]
[23.1,0,2,4,6,8,10,12,14,{"$f":"IF(B233=0,0,Startup!$C$2)+IF(C233=2,0,Startup!$C$3)+IF(D233=4,0,Startup!$C$4)+IF(E233=6,0,Startup!$C$5)+IF(F233=8,0,Startup!$C$6)+IF(G233=10,0,Startup!$C$7)+IF(H233=12,0,Startup!$C$8)+IF(I233=14,0,Startup!$C$9)","v":0},"No"]
[23.2,0,2,4,6,8,10,12,14,{"$f":"IF(B234=0,0,Startup!$C$2)+IF(C234=2,0,Startup!$C$3)+IF(D234=4,0,Startup!$C$4)+IF(E234=6,0,Startup!$C$5)+IF(F234=8,0,Startup!$C$6)+IF(G234=10,0,Startup!$C$7)+IF(H234=12,0,Startup!$C$8)+IF(I234=14,0,Startup!$C$9)","v":0},"No"]
[23.3,0,2,4,6,8,10,12,14,{"$f":"IF(B235=0,0,Startup!$C$2)+IF(C235=2,0,Startup!$C$3)+IF(D235=4,0,Startup!$C$4)+IF(E235=6,0,Startup!$C$5)+IF(F235=8,0,Startup!$C$6)+IF(G235=10,0,Startup!$C$7)+IF(H235=12,0,Startup!$C$8)+IF(I235=14,0,Startup!$C$9)","v":0},"No"]
[23.4,0,2,4,6,8,10,12,14,{"$f":"IF(B236=0,0,Startup!$C$2)+IF(C236=2,0,Startup!$C$3)+IF(D236=4,0,Startup!$C$4)+IF(E236=6,0,Startup!$C$5)+IF(F236=8,0,Startup!$C$6)+IF(G236=10,0,Startup!$C$7)+IF(H236=12,0,Startup!$C$8)+IF(I236=14,0,Startup!$C$9)","v":0},"No"]
[23.5,0,2,4,6,8,10,12,14,{"$f":"IF(B237=0,0,Startup!$C$2)+IF(C237=2,0,Startup!$C$3)+IF(D237=4,0,Startup!$C$4)+IF(E237=6,0,Startup!$C$5)+IF(F237=8,0,Startup!$C$6)+IF(G237=10,0,Startup!$C$7)+IF(H237=12,0,Startup!$C$8)+IF(I237=14,0,Startup!$C$9)","v":0},"No"]
[23.6,0,2,4,6,8,10,12,14,{"$f":"IF(B238=0,0,Startup!$C$2)+IF(C238=2,0,Startup!$C$3)+IF(D238=4,0,Startup!$C$4)+IF(E238=6,0,Startup!$C$5)+IF(F238=8,0,Startup!$C$6)+IF(G238=10,0,Startup!$C$7)+IF(H238=12,0,Startup!$C$8)+IF(I238=14,0,Startup!$C$9)","v":0},"No"]
[23.7,0,2,4,6,8,10,12,14,{"$f":"IF(B239=0,0,Startup!$C$2)+IF(C239=2,0,Startup!$C$3)+IF(D239=4,0,Startup!$C$4)+IF(E239=6,0,Startup!$C$5)+IF(F239=8,0,Startup!$C$6)+IF(G239=10,0,Startup!$C$7)+IF(H239=12,0,Startup!$C$8)+IF(I239=14,0,Startup!$C$9)","v":0},"No"]
[23.8,0,2,4,6,8,10,12,14,{"$f":"IF(B240=0,0,Startup!$C$2)+IF(C240=2,0,Startup!$C$3)+IF(D240=4,0,Startup!$C$4)+IF(E240=6,0,Startup!$C$5)+IF(F240=8,0,Startup!$C$6)+IF(G240=10,0,Startup!$C$7)+IF(H240=12,0,Startup!$C$8)+IF(I240=14,0,Startup!$C$9)","v":0},"No"]
[23.9,0,2,4,6,8,10,12,14,{"$f":"IF(B241=0,0,Startup!$C$2)+IF(C241=2,0,Startup!$C$3)+IF(D241=4,0,Startup!$C$4)+IF(E241=6,0,Startup!$C$5)+IF(F241=8,0,Startup!$C$6)+IF(G241=10,0,Startup!$C$7)+IF(H241=12,0,Startup!$C$8)+IF(I241=14,0,Startup!$C$9)","v":0},"No"]
[24,0,2,4,6,8,10,12,14,{"$f":"IF(B242=0,0,Startup!$C$2)+IF(C242=2,0,Startup!$C$3)+IF(D242=4,0,Startup!$C$4)+IF(E242=6,0,Startup!$C$5)+IF(F242=8,0,Startup!$C$6)+IF(G242=10,0,Startup!$C$7)+IF(H242=12,0,Startup!$C$8)+IF(I242=14,0,Startup!$C$9)","v":0},"No"]
[24.1,0,2,4,6,8,10,12,14,{"$f":"IF(B243=0,0,Startup!$C$2)+IF(C243=2,0,Startup!$C$3)+IF(D243=4,0,Startup!$C$4)+IF(E243=6,0,Startup!$C$5)+IF(F243=8,0,Startup!$C$6)+IF(G243=10,0,Startup!$C$7)+IF(H243=12,0,Startup!$C$8)+IF(I243=14,0,Startup!$C$9)","v":0},"No"]
[24.2,0,2,4,6,8,10,12,14,{"$f":"IF(B244=0,0,Startup!$C$2)+IF(C244=2,0,Startup!$C$3)+IF(D244=4,0,Startup!$C$4)+IF(E244=6,0,Startup!$C$5)+IF(F244=8,0,Startup!$C$6)+IF(G244=10,0,Startup!$C$7)+IF(H244=12,0,Startup!$C$8)+IF(I244=14,0,Startup!$C$9)","v":0},"No"]
[24.3,0,2,4,6,8,10,12,14,{"$f":"IF(B245=0,0,Startup!$C$2)+IF(C245=2,0,Startup!$C$3)+IF(D245=4,0,Startup!$C$4)+IF(E245=6,0,Startup!$C$5)+IF(F245=8,0,Startup!$C$6)+IF(G245=10,0,Startup!$C$7)+IF(H245=12,0,Startup!$C$8)+IF(I245=14,0,Startup!$C$9)","v":0},"No"]
[24.4,0,2,4,6,8,10,12,14,{"$f":"IF(B246=0,0,Startup!$C$2)+IF(C246=2,0,Startup!$C$3)+IF(D246=4,0,Startup!$C$4)+IF(E246=6,0,Startup!$C$5)+IF(F246=8,0,Startup!$C$6)+IF(G246=10,0,Startup!$C$7)+IF(H246=12,0,Startup!$C$8)+IF(I246=14,0,Startup!$C$9)","v":0},"No"]
[24.5,0,2,4,6,8,10,12,14,{"$f":"IF(B247=0,0,Startup!$C$2)+IF(C247=2,0,Startup!$C$3)+IF(D247=4,0,Startup!$C$4)+IF(E247=6,0,Startup!$C$5)+IF(F247=8,0,Startup!$C$6)+IF(G247=10,0,Startup!$C$7)+IF(H247=12,0,Startup!$C$8)+IF(I247=14,0,Startup!$C$9)","v":0},"No"]
[24.6,0,2,4,6,8,10,12,14,{"$f":"IF(B248=0,0,Startup!$C$2)+IF(C248=2,0,Startup!$C$3)+IF(D248=4,0,Startup!$C$4)+IF(E248=6,0,Startup!$C$5)+IF(F248=8,0,Startup!$C$6)+IF(G248=10,0,Startup!$C$7)+IF(H248=12,0,Startup!$C$8)+IF(I248=14,0,Startup!$C$9)","v":0},"No"]
[24.7,0,2,4,6,8,10,12,14,{"$f":"IF(B249=0,0,Startup!$C$2)+IF(C249=2,0,Startup!$C$3)+IF(D249=4,0,Startup!$C$4)+IF(E249=6,0,Startup!$C$5)+IF(F249=8,0,Startup!$C$6)+IF(G249=10,0,Startup!$C$7)+IF(H249=12,0,Startup!$C$8)+IF(I249=14,0,Startup!$C$9)","v":0},"No"]
[24.8,0,2,4,6,8,10,12,14,{"$f":"IF(B250=0,0,Startup!$C$2)+IF(C250=2,0,Startup!$C$3)+IF(D250=4,0,Startup!$C$4)+IF(E250=6,0,Startup!$C$5)+IF(F250=8,0,Startup!$C$6)+IF(G250=10,0,Startup!$C$7)+IF(H250=12,0,Startup!$C$8)+IF(I250=14,0,Startup!$C$9)","v":0},"No"]
[24.9,0,2,4,6,8,10,12,14,{"$f":"IF(B251=0,0,Startup!$C$2)+IF(C251=2,0,Startup!$C$3)+IF(D251=4,0,Startup!$C$4)+IF(E251=6,0,Startup!$C$5)+IF(F251=8,0,Startup!$C$6)+IF(G251=10,0,Startup!$C$7)+IF(H251=12,0,Startup!$C$8)+IF(I251=14,0,Startup!$C$9)","v":0},"No"]
[25,0,2,4,6,8,10,12,14,{"$f":"IF(B252=0,0,Startup!$C$2)+IF(C252=2,0,Startup!$C$3)+IF(D252=4,0,Startup!$C$4)+IF(E252=6,0,Startup!$C$5)+IF(F252=8,0,Startup!$C$6)+IF(G252=10,0,Startup!$C$7)+IF(H252=12,0,Startup!$C$8)+IF(I252=14,0,Startup!$C$9)","v":0},"No"]
[25.1,0,2,4,6,8,10,12,14,{"$f":"IF(B253=0,0,Startup!$C$2)+IF(C253=2,0,Startup!$C$3)+IF(D253=4,0,Startup!$C$4)+IF(E253=6,0,Startup!$C$5)+IF(F253=8,0,Startup!$C$6)+IF(G253=10,0,Startup!$C$7)+IF(H253=12,0,Startup!$C$8)+IF(I253=14,0,Startup!$C$9)","v":0},"No"]
[25.2,0,2,4,6,8,10,12,14,{"$f":"IF(B254=0,0,Startup!$C$2)+IF(C254=2,0,Startup!$C$3)+IF(D254=4,0,Startup!$C$4)+IF(E254=6,0,Startup!$C$5)+IF(F254=8,0,Startup!$C$6)+IF(G254=10,0,Startup!$C$7)+IF(H254=12,0,Startup!$C$8)+IF(I254=14,0,Startup!$C$9)","v":0},"No"]
[25.3,0,2,4,6,8,10,12,14,{"$f":"IF(B255=0,0,Startup!$C$2)+IF(C255=2,0,Startup!$C$3)+IF(D255=4,0,Startup!$C$4)+IF(E255=6,0,Startup!$C$5)+IF(F255=8,0,Startup!$C$6)+IF(G255=10,0,Startup!$C$7)+IF(H255=12,0,Startup!$C$8)+IF(I255=14,0,Startup!$C$9)","v":0},"No"]
[25.4,0,2,4,6,8,10,12,14,{"$f":"IF(B256=0,0,Startup!$C$2)+IF(C256=2,0,Startup!$C$3)+IF(D256=4,0,Startup!$C$4)+IF(E256=6,0,Startup!$C$5)+IF(F256=8,0,Startup!$C$6)+IF(G256=10,0,Startup!$C$7)+IF(H256=12,0,Startup!$C$8)+IF(I256=14,0,Startup!$C$9)","v":0},"No"]
[25.5,0,2,4,6,8,10,12,14,{"$f":"IF(B257=0,0,Startup!$C$2)+IF(C257=2,0,Startup!$C$3)+IF(D257=4,0,Startup!$C$4)+IF(E257=6,0,Startup!$C$5)+IF(F257=8,0,Startup!$C$6)+IF(G257=10,0,Startup!$C$7)+IF(H257=12,0,Startup!$C$8)+IF(I257=14,0,Startup!$C$9)","v":0},"No"]
[25.6,0,2,4,6,8,10,12,14,{"$f":"IF(B258=0,0,Startup!$C$2)+IF(C258=2,0,Startup!$C$3)+IF(D258=4,0,Startup!$C$4)+IF(E258=6,0,Startup!$C$5)+IF(F258=8,0,Startup!$C$6)+IF(G258=10,0,Startup!$C$7)+IF(H258=12,0,Startup!$C$8)+IF(I258=14,0,Startup!$C$9)","v":0},"No"]
[25.7,0,2,4,6,8,10,12,14,{"$f":"IF(B259=0,0,Startup!$C$2)+IF(C259=2,0,Startup!$C$3)+IF(D259=4,0,Startup!$C$4)+IF(E259=6,0,Startup!$C$5)+IF(F259=8,0,Startup!$C$6)+IF(G259=10,0,Startup!$C$7)+IF(H259=12,0,Startup!$C$8)+IF(I259=14,0,Startup!$C$9)","v":0},"No"]
[25.8,0,2,4,6,8,10,12,14,{"$f":"IF(B260=0,0,Startup!$C$2)+IF(C260=2,0,Startup!$C$3)+IF(D260=4,0,Startup!$C$4)+IF(E260=6,0,Startup!$C$5)+IF(F260=8,0,Startup!$C$6)+IF(G260=10,0,Startup!$C$7)+IF(H260=12,0,Startup!$C$8)+IF(I260=14,0,Startup!$C$9)","v":0},{"$f":"IF(J260<>J259,\"Yes\",\"No\")","v":"No"}]
[25.9,0,2,4,6,8,10,12,14,{"$f":"IF(B261=0,0,Startup!$C$2)+IF(C261=2,0,Startup!$C$3)+IF(D261=4,0,Startup!$C$4)+IF(E261=6,0,Startup!$C$5)+IF(F261=8,0,Startup!$C$6)+IF(G261=10,0,Startup!$C$7)+IF(H261=12,0,Startup!$C$8)+IF(I261=14,0,Startup!$C$9)","v":0},"No"]
[26,0,2,4,6,8,10,12,14,{"$f":"IF(B262=0,0,Startup!$C$2)+IF(C262=2,0,Startup!$C$3)+IF(D262=4,0,Startup!$C$4)+IF(E262=6,0,Startup!$C$5)+IF(F262=8,0,Startup!$C$6)+IF(G262=10,0,Startup!$C$7)+IF(H262=12,0,Startup!$C$8)+IF(I262=14,0,Startup!$C$9)","v":0},"No"]
[26.1,0,2,4,6,8,10,12,14,{"$f":"IF(B263=0,0,Startup!$C$2)+IF(C263=2,0,Startup!$C$3)+IF(D263=4,0,Startup!$C$4)+IF(E263=6,0,Startup!$C$5)+IF(F263=8,0,Startup!$C$6)+IF(G263=10,0,Startup!$C$7)+IF(H263=12,0,Startup!$C$8)+IF(I263=14,0,Startup!$C$9)","v":0},"No"]
[26.2,0,2,4,6,8,10,12,14,{"$f":"IF(B264=0,0,Startup!$C$2)+IF(C264=2,0,Startup!$C$3)+IF(D264=4,0,Startup!$C$4)+IF(E264=6,0,Startup!$C$5)+IF(F264=8,0,Startup!$C$6)+IF(G264=10,0,Startup!$C$7)+IF(H264=12,0,Startup!$C$8)+IF(I264=14,0,Startup!$C$9)","v":0},"No"]
[26.3,0,2,4,6,8,10,12,14,{"$f":"IF(B265=0,0,Startup!$C$2)+IF(C265=2,0,Startup!$C$3)+IF(D265=4,0,Startup!$C$4)+IF(E265=6,0,Startup!$C$5)+IF(F265=8,0,Startup!$C$6)+IF(G265=10,0,Startup!$C$7)+IF(H265=12,0,Startup!$C$8)+IF(I265=14,0,Startup!$C$9)","v":0},"No"]
[26.4,0,2,4,6,8,10,12,14,{"$f":"IF(B266=0,0,Startup!$C$2)+IF(C266=2,0,Startup!$C$3)+IF(D266=4,0,Startup!$C$4)+IF(E266=6,0,Startup!$C$5)+IF(F266=8,0,Startup!$C$6)+IF(G266=10,0,Startup!$C$7)+IF(H266=12,0,Startup!$C$8)+IF(I266=14,0,Startup!$C$9)","v":0},"No"]
[26.5,0,2,4,6,8,10,12,14,{"$f":"IF(B267=0,0,Startup!$C$2)+IF(C267=2,0,Startup!$C$3)+IF(D267=4,0,Startup!$C$4)+IF(E267=6,0,Startup!$C$5)+IF(F267=8,0,Startup!$C$6)+IF(G267=10,0,Startup!$C$7)+IF(H267=12,0,Startup!$C$8)+IF(I267=14,0,Startup!$C$9)","v":0},"No"]
[26.6,0,2,4,6,8,10,12,14,{"$f":"IF(B268=0,0,Startup!$C$2)+IF(C268=2,0,Startup!$C$3)+IF(D268=4,0,Startup!$C$4)+IF(E268=6,0,Startup!$C$5)+IF(F268=8,0,Startup!$C$6)+IF(G268=10,0,Startup!$C$7)+IF(H268=12,0,Startup!$C$8)+IF(I268=14,0,Startup!$C$9)","v":0},"No"]
[26.7,0,2,4,6,8,10,12,14,{"$f":"IF(B269=0,0,Startup!$C$2)+IF(C269=2,0,Startup!$C$3)+IF(D269=4,0,Startup!$C$4)+IF(E269=6,0,Startup!$C$5)+IF(F269=8,0,Startup!$C$6)+IF(G269=10,0,Startup!$C$7)+IF(H269=12,0,Startup!$C$8)+IF(I269=14,0,Startup!$C$9)","v":0},"No"]
[26.8,0,2,4,6,8,10,12,14,{"$f":"IF(B270=0,0,Startup!$C$2)+IF(C270=2,0,Startup!$C$3)+IF(D270=4,0,Startup!$C$4)+IF(E270=6,0,Startup!$C$5)+IF(F270=8,0,Startup!$C$6)+IF(G270=10,0,Startup!$C$7)+IF(H270=12,0,Startup!$C$8)+IF(I270=14,0,Startup!$C$9)","v":0},"No"]
[26.9,0,2,4,6,8,10,12,14,{"$f":"IF(B271=0,0,Startup!$C$2)+IF(C271=2,0,Startup!$C$3)+IF(D271=4,0,Startup!$C$4)+IF(E271=6,0,Startup!$C$5)+IF(F271=8,0,Startup!$C$6)+IF(G271=10,0,Startup!$C$7)+IF(H271=12,0,Startup!$C$8)+IF(I271=14,0,Startup!$C$9)","v":0},"No"]
[27,0,2,4,6,8,10,12,14,{"$f":"IF(B272=0,0,Startup!$C$2)+IF(C272=2,0,Startup!$C$3)+IF(D272=4,0,Startup!$C$4)+IF(E272=6,0,Startup!$C$5)+IF(F272=8,0,Startup!$C$6)+IF(G272=10,0,Startup!$C$7)+IF(H272=12,0,Startup!$C$8)+IF(I272=14,0,Startup!$C$9)","v":0},"No"]
[27.1,0,2,4,6,8,10,12,14,{"$f":"IF(B273=0,0,Startup!$C$2)+IF(C273=2,0,Startup!$C$3)+IF(D273=4,0,Startup!$C$4)+IF(E273=6,0,Startup!$C$5)+IF(F273=8,0,Startup!$C$6)+IF(G273=10,0,Startup!$C$7)+IF(H273=12,0,Startup!$C$8)+IF(I273=14,0,Startup!$C$9)","v":0},"No"]
[27.2,0,2,4,6,8,10,12,14,{"$f":"IF(B274=0,0,Startup!$C$2)+IF(C274=2,0,Startup!$C$3)+IF(D274=4,0,Startup!$C$4)+IF(E274=6,0,Startup!$C$5)+IF(F274=8,0,Startup!$C$6)+IF(G274=10,0,Startup!$C$7)+IF(H274=12,0,Startup!$C$8)+IF(I274=14,0,Startup!$C$9)","v":0},"No"]
[27.3,0,2,4,6,8,10,12,14,{"$f":"IF(B275=0,0,Startup!$C$2)+IF(C275=2,0,Startup!$C$3)+IF(D275=4,0,Startup!$C$4)+IF(E275=6,0,Startup!$C$5)+IF(F275=8,0,Startup!$C$6)+IF(G275=10,0,Startup!$C$7)+IF(H275=12,0,Startup!$C$8)+IF(I275=14,0,Startup!$C$9)","v":0},"No"]
[27.4,0,2,4,6,8,10,12,14,{"$f":"IF(B276=0,0,Startup!$C$2)+IF(C276=2,0,Startup!$C$3)+IF(D276=4,0,Startup!$C$4)+IF(E276=6,0,Startup!$C$5)+IF(F276=8,0,Startup!$C$6)+IF(G276=10,0,Startup!$C$7)+IF(H276=12,0,Startup!$C$8)+IF(I276=14,0,Startup!$C$9)","v":0},"No"]
[27.5,0,2,4,6,8,10,12,14,{"$f":"IF(B277=0,0,Startup!$C$2)+IF(C277=2,0,Startup!$C$3)+IF(D277=4,0,Startup!$C$4)+IF(E277=6,0,Startup!$C$5)+IF(F277=8,0,Startup!$C$6)+IF(G277=10,0,Startup!$C$7)+IF(H277=12,0,Startup!$C$8)+IF(I277=14,0,Startup!$C$9)","v":0},"No"]
[27.6,0,2,4,6,8,10,12,14,{"$f":"IF(B278=0,0,Startup!$C$2)+IF(C278=2,0,Startup!$C$3)+IF(D278=4,0,Startup!$C$4)+IF(E278=6,0,Startup!$C$5)+IF(F278=8,0,Startup!$C$6)+IF(G278=10,0,Startup!$C$7)+IF(H278=12,0,Startup!$C$8)+IF(I278=14,0,Startup!$C$9)","v":0},"No"]
[27.7,0,2,4,6,8,10,12,14,{"$f":"IF(B279=0,0,Startup!$C$2)+IF(C279=2,0,Startup!$C$3)+IF(D279=4,0,Startup!$C$4)+IF(E279=6,0,Startup!$C$5)+IF(F279=8,0,Startup!$C$6)+IF(G279=10,0,Startup!$C$7)+IF(H279=12,0,Startup!$C$8)+IF(I279=14,0,Startup!$C$9)","v":0},"No"]
[27.8,0,2,4,6,8,10,12,14,{"$f":"IF(B280=0,0,Startup!$C$2)+IF(C280=2,0,Startup!$C$3)+IF(D280=4,0,Startup!$C$4)+IF(E280=6,0,Startup!$C$5)+IF(F280=8,0,Startup!$C$6)+IF(G280=10,0,Startup!$C$7)+IF(H280=12,0,Startup!$C$8)+IF(I280=14,0,Startup!$C$9)","v":0},"No"]
[27.9,0,2,4,6,8,10,12,14,{"$f":"IF(B281=0,0,Startup!$C$2)+IF(C281=2,0,Startup!$C$3)+IF(D281=4,0,Startup!$C$4)+IF(E281=6,0,Startup!$C$5)+IF(F281=8,0,Startup!$C$6)+IF(G281=10,0,Startup!$C$7)+IF(H281=12,0,Startup!$C$8)+IF(I281=14,0,Startup!$C$9)","v":0},"No"]
[28,0,2,4,6,8,10,12,14,{"$f":"IF(B282=0,0,Startup!$C$2)+IF(C282=2,0,Startup!$C$3)+IF(D282=4,0,Startup!$C$4)+IF(E282=6,0,Startup!$C$5)+IF(F282=8,0,Startup!$C$6)+IF(G282=10,0,Startup!$C$7)+IF(H282=12,0,Startup!$C$8)+IF(I282=14,0,Startup!$C$9)","v":0},"No"]
[28.1,0,2,4,6,8,10,12,14,{"$f":"IF(B283=0,0,Startup!$C$2)+IF(C283=2,0,Startup!$C$3)+IF(D283=4,0,Startup!$C$4)+IF(E283=6,0,Startup!$C$5)+IF(F283=8,0,Startup!$C$6)+IF(G283=10,0,Startup!$C$7)+IF(H283=12,0,Startup!$C$8)+IF(I283=14,0,Startup!$C$9)","v":0},"No"]
[28.2,0,2,4,6,8,10,12,14,{"$f":"IF(B284=0,0,Startup!$C$2)+IF(C284=2,0,Startup!$C$3)+IF(D284=4,0,Startup!$C$4)+IF(E284=6,0,Startup!$C$5)+IF(F284=8,0,Startup!$C$6)+IF(G284=10,0,Startup!$C$7)+IF(H284=12,0,Startup!$C$8)+IF(I284=14,0,Startup!$C$9)","v":0},"No"]
[28.3,0,2,4,6,8,10,12,14,{"$f":"IF(B285=0,0,Startup!$C$2)+IF(C285=2,0,Startup!$C$3)+IF(D285=4,0,Startup!$C$4)+IF(E285=6,0,Startup!$C$5)+IF(F285=8,0,Startup!$C$6)+IF(G285=10,0,Startup!$C$7)+IF(H285=12,0,Startup!$C$8)+IF(I285=14,0,Startup!$C$9)","v":0},"No"]
[28.4,0,2,4,6,8,10,12,14,{"$f":"IF(B286=0,0,Startup!$C$2)+IF(C286=2,0,Startup!$C$3)+IF(D286=4,0,Startup!$C$4)+IF(E286=6,0,Startup!$C$5)+IF(F286=8,0,Startup!$C$6)+IF(G286=10,0,Startup!$C$7)+IF(H286=12,0,Startup!$C$8)+IF(I286=14,0,Startup!$C$9)","v":0},"No"]
[28.5,0,2,4,6,8,10,12,14,{"$f":"IF(B287=0,0,Startup!$C$2)+IF(C287=2,0,Startup!$C$3)+IF(D287=4,0,Startup!$C$4)+IF(E287=6,0,Startup!$C$5)+IF(F287=8,0,Startup!$C$6)+IF(G287=10,0,Startup!$C$7)+IF(H287=12,0,Startup!$C$8)+IF(I287=14,0,Startup!$C$9)","v":0},"No"]
[28.6,0,2,4,6,8,10,12,14,{"$f":"IF(B288=0,0,Startup!$C$2)+IF(C288=2,0,Startup!$C$3)+IF(D288=4,0,Startup!$C$4)+IF(E288=6,0,Startup!$C$5)+IF(F288=8,0,Startup!$C$6)+IF(G288=10,0,Startup!$C$7)+IF(H288=12,0,Startup!$C$8)+IF(I288=14,0,Startup!$C$9)","v":0},"No"]
[28.7,0,2,4,6,8,10,12,14,{"$f":"IF(B289=0,0,Startup!$C$2)+IF(C289=2,0,Startup!$C$3)+IF(D289=4,0,Startup!$C$4)+IF(E289=6,0,Startup!$C$5)+IF(F289=8,0,Startup!$C$6)+IF(G289=10,0,Startup!$C$7)+IF(H289=12,0,Startup!$C$8)+IF(I289=14,0,Startup!$C$9)","v":0},"No"]
[28.8,0,2,4,6,8,10,12,14,{"$f":"IF(B290=0,0,Startup!$C$2)+IF(C290=2,0,Startup!$C$3)+IF(D290=4,0,Startup!$C$4)+IF(E290=6,0,Startup!$C$5)+IF(F290=8,0,Startup!$C$6)+IF(G290=10,0,Startup!$C$7)+IF(H290=12,0,Startup!$C$8)+IF(I290=14,0,Startup!$C$9)","v":0},"No"]
[28.9,0,2,4,6,8,10,12,14,{"$f":"IF(B291=0,0,Startup!$C$2)+IF(C291=2,0,Startup!$C$3)+IF(D291=4,0,Startup!$C$4)+IF(E291=6,0,Startup!$C$5)+IF(F291=8,0,Startup!$C$6)+IF(G291=10,0,Startup!$C$7)+IF(H291=12,0,Startup!$C$8)+IF(I291=14,0,Startup!$C$9)","v":0},"No"]
[29,0,2,4,6,8,10,12,14,{"$f":"IF(B292=0,0,Startup!$C$2)+IF(C292=2,0,Startup!$C$3)+IF(D292=4,0,Startup!$C$4)+IF(E292=6,0,Startup!$C$5)+IF(F292=8,0,Startup!$C$6)+IF(G292=10,0,Startup!$C$7)+IF(H292=12,0,Startup!$C$8)+IF(I292=14,0,Startup!$C$9)","v":0},"No"]
[29.1,0,2,4,6,8,10,12,14,{"$f":"IF(B293=0,0,Startup!$C$2)+IF(C293=2,0,Startup!$C$3)+IF(D293=4,0,Startup!$C$4)+IF(E293=6,0,Startup!$C$5)+IF(F293=8,0,Startup!$C$6)+IF(G293=10,0,Startup!$C$7)+IF(H293=12,0,Startup!$C$8)+IF(I293=14,0,Startup!$C$9)","v":0},"No"]
[29.2,0,2,4,6,8,10,12,14,{"$f":"IF(B294=0,0,Startup!$C$2)+IF(C294=2,0,Startup!$C$3)+IF(D294=4,0,Startup!$C$4)+IF(E294=6,0,Startup!$C$5)+IF(F294=8,0,Startup!$C$6)+IF(G294=10,0,Startup!$C$7)+IF(H294=12,0,Startup!$C$8)+IF(I294=14,0,Startup!$C$9)","v":0},"No"]
[29.3,0,2,4,6,8,10,12,14,{"$f":"IF(B295=0,0,Startup!$C$2)+IF(C295=2,0,Startup!$C$3)+IF(D295=4,0,Startup!$C$4)+IF(E295=6,0,Startup!$C$5)+IF(F295=8,0,Startup!$C$6)+IF(G295=10,0,Startup!$C$7)+IF(H295=12,0,Startup!$C$8)+IF(I295=14,0,Startup!$C$9)","v":0},"No"]
[29.4,0,2,4,6,8,10,12,14,{"$f":"IF(B296=0,0,Startup!$C$2)+IF(C296=2,0,Startup!$C$3)+IF(D296=4,0,Startup!$C$4)+IF(E296=6,0,Startup!$C$5)+IF(F296=8,0,Startup!$C$6)+IF(G296=10,0,Startup!$C$7)+IF(H296=12,0,Startup!$C$8)+IF(I296=14,0,Startup!$C$9)","v":0},"No"]
[29.5,0,2,4,6,8,10,12,14,{"$f":"IF(B297=0,0,Startup!$C$2)+IF(C297=2,0,Startup!$C$3)+IF(D297=4,0,Startup!$C$4)+IF(E297=6,0,Startup!$C$5)+IF(F297=8,0,Startup!$C$6)+IF(G297=10,0,Startup!$C$7)+IF(H297=12,0,Startup!$C$8)+IF(I297=14,0,Startup!$C$9)","v":0},"No"]
[29.6,0,2,4,6,8,10,12,14,{"$f":"IF(B298=0,0,Startup!$C$2)+IF(C298=2,0,Startup!$C$3)+IF(D298=4,0,Startup!$C$4)+IF(E298=6,0,Startup!$C$5)+IF(F298=8,0,Startup!$C$6)+IF(G298=10,0,Startup!$C$7)+IF(H298=12,0,Startup!$C$8)+IF(I298=14,0,Startup!$C$9)","v":0},"No"]
[29.7,0,2,4,6,8,10,12,14,{"$f":"IF(B299=0,0,Startup!$C$2)+IF(C299=2,0,Startup!$C$3)+IF(D299=4,0,Startup!$C$4)+IF(E299=6,0,Startup!$C$5)+IF(F299=8,0,Startup!$C$6)+IF(G299=10,0,Startup!$C$7)+IF(H299=12,0,Startup!$C$8)+IF(I299=14,0,Startup!$C$9)","v":0},"No"]
[29.8,0,2,4,6,8,10,12,14,{"$f":"IF(B300=0,0,Startup!$C$2)+IF(C300=2,0,Startup!$C$3)+IF(D300=4,0,Startup!$C$4)+IF(E300=6,0,Startup!$C$5)+IF(F300=8,0,Startup!$C$6)+IF(G300=10,0,Startup!$C$7)+IF(H300=12,0,Startup!$C$8)+IF(I300=14,0,Startup!$C$9)","v":0},"No"]
[29.9,0,2,4,6,8,10,12,14,{"$f":"IF(B301=0,0,Startup!$C$2)+IF(C301=2,0,Startup!$C$3)+IF(D301=4,0,Startup!$C$4)+IF(E301=6,0,Startup!$C$5)+IF(F301=8,0,Startup!$C$6)+IF(G301=10,0,Startup!$C$7)+IF(H301=12,0,Startup!$C$8)+IF(I301=14,0,Startup!$C$9)","v":0},"No"]
[30,0,2,4,6,8,10,12,14,{"$f":"IF(B302=0,0,Startup!$C$2)+IF(C302=2,0,Startup!$C$3)+IF(D302=4,0,Startup!$C$4)+IF(E302=6,0,Startup!$C$5)+IF(F302=8,0,Startup!$C$6)+IF(G302=10,0,Startup!$C$7)+IF(H302=12,0,Startup!$C$8)+IF(I302=14,0,Startup!$C$9)","v":0},"No"]
[30.1,0,2,4,6,8,10,12,14,{"$f":"IF(B303=0,0,Startup!$C$2)+IF(C303=2,0,Startup!$C$3)+IF(D303=4,0,Startup!$C$4)+IF(E303=6,0,Startup!$C$5)+IF(F303=8,0,Startup!$C$6)+IF(G303=10,0,Startup!$C$7)+IF(H303=12,0,Startup!$C$8)+IF(I303=14,0,Startup!$C$9)","v":0},"No"]
[30.2,0,2,4,6,8,10,12,14,{"$f":"IF(B304=0,0,Startup!$C$2)+IF(C304=2,0,Startup!$C$3)+IF(D304=4,0,Startup!$C$4)+IF(E304=6,0,Startup!$C$5)+IF(F304=8,0,Startup!$C$6)+IF(G304=10,0,Startup!$C$7)+IF(H304=12,0,Startup!$C$8)+IF(I304=14,0,Startup!$C$9)","v":0},"No"]
[30.3,0,2,4,6,8,10,12,14,{"$f":"IF(B305=0,0,Startup!$C$2)+IF(C305=2,0,Startup!$C$3)+IF(D305=4,0,Startup!$C$4)+IF(E305=6,0,Startup!$C$5)+IF(F305=8,0,Startup!$C$6)+IF(G305=10,0,Startup!$C$7)+IF(H305=12,0,Startup!$C$8)+IF(I305=14,0,Startup!$C$9)","v":0},"No"]
[30.4,0,2,4,6,8,10,12,14,{"$f":"IF(B306=0,0,Startup!$C$2)+IF(C306=2,0,Startup!$C$3)+IF(D306=4,0,Startup!$C$4)+IF(E306=6,0,Startup!$C$5)+IF(F306=8,0,Startup!$C$6)+IF(G306=10,0,Startup!$C$7)+IF(H306=12,0,Startup!$C$8)+IF(I306=14,0,Startup!$C$9)","v":0},"No"]
[30.5,0,2,4,6,8,10,12,14,{"$f":"IF(B307=0,0,Startup!$C$2)+IF(C307=2,0,Startup!$C$3)+IF(D307=4,0,Startup!$C$4)+IF(E307=6,0,Startup!$C$5)+IF(F307=8,0,Startup!$C$6)+IF(G307=10,0,Startup!$C$7)+IF(H307=12,0,Startup!$C$8)+IF(I307=14,0,Startup!$C$9)","v":0},"No"]
[30.6,0,2,4,6,8,10,12,14,{"$f":"IF(B308=0,0,Startup!$C$2)+IF(C308=2,0,Startup!$C$3)+IF(D308=4,0,Startup!$C$4)+IF(E308=6,0,Startup!$C$5)+IF(F308=8,0,Startup!$C$6)+IF(G308=10,0,Startup!$C$7)+IF(H308=12,0,Startup!$C$8)+IF(I308=14,0,Startup!$C$9)","v":0},"No"]
[30.7,0,2,4,6,8,10,12,14,{"$f":"IF(B309=0,0,Startup!$C$2)+IF(C309=2,0,Startup!$C$3)+IF(D309=4,0,Startup!$C$4)+IF(E309=6,0,Startup!$C$5)+IF(F309=8,0,Startup!$C$6)+IF(G309=10,0,Startup!$C$7)+IF(H309=12,0,Startup!$C$8)+IF(I309=14,0,Startup!$C$9)","v":0},"No"]
[30.8,0,2,4,6,8,10,12,14,{"$f":"IF(B310=0,0,Startup!$C$2)+IF(C310=2,0,Startup!$C$3)+IF(D310=4,0,Startup!$C$4)+IF(E310=6,0,Startup!$C$5)+IF(F310=8,0,Startup!$C$6)+IF(G310=10,0,Startup!$C$7)+IF(H310=12,0,Startup!$C$8)+IF(I310=14,0,Startup!$C$9)","v":0},"No"]
[30.9,0,2,4,6,8,10,12,14,{"$f":"IF(B311=0,0,Startup!$C$2)+IF(C311=2,0,Startup!$C$3)+IF(D311=4,0,Startup!$C$4)+IF(E311=6,0,Startup!$C$5)+IF(F311=8,0,Startup!$C$6)+IF(G311=10,0,Startup!$C$7)+IF(H311=12,0,Startup!$C$8)+IF(I311=14,0,Startup!$C$9)","v":0},"No"]
[31,0,2,4,6,8,10,12,14,{"$f":"IF(B312=0,0,Startup!$C$2)+IF(C312=2,0,Startup!$C$3)+IF(D312=4,0,Startup!$C$4)+IF(E312=6,0,Startup!$C$5)+IF(F312=8,0,Startup!$C$6)+IF(G312=10,0,Startup!$C$7)+IF(H312=12,0,Startup!$C$8)+IF(I312=14,0,Startup!$C$9)","v":0},"No"]
[31.1,0,2,4,6,8,10,12,14,{"$f":"IF(B313=0,0,Startup!$C$2)+IF(C313=2,0,Startup!$C$3)+IF(D313=4,0,Startup!$C$4)+IF(E313=6,0,Startup!$C$5)+IF(F313=8,0,Startup!$C$6)+IF(G313=10,0,Startup!$C$7)+IF(H313=12,0,Startup!$C$8)+IF(I313=14,0,Startup!$C$9)","v":0},"No"]
[31.2,0,2,4,6,8,10,12,14,{"$f":"IF(B314=0,0,Startup!$C$2)+IF(C314=2,0,Startup!$C$3)+IF(D314=4,0,Startup!$C$4)+IF(E314=6,0,Startup!$C$5)+IF(F314=8,0,Startup!$C$6)+IF(G314=10,0,Startup!$C$7)+IF(H314=12,0,Startup!$C$8)+IF(I314=14,0,Startup!$C$9)","v":0},"No"]
[31.3,0,2,4,6,8,10,12,14,{"$f":"IF(B315=0,0,Startup!$C$2)+IF(C315=2,0,Startup!$C$3)+IF(D315=4,0,Startup!$C$4)+IF(E315=6,0,Startup!$C$5)+IF(F315=8,0,Startup!$C$6)+IF(G315=10,0,Startup!$C$7)+IF(H315=12,0,Startup!$C$8)+IF(I315=14,0,Startup!$C$9)","v":0},"No"]
[31.4,0,2,4,6,8,10,12,14,{"$f":"IF(B316=0,0,Startup!$C$2)+IF(C316=2,0,Startup!$C$3)+IF(D316=4,0,Startup!$C$4)+IF(E316=6,0,Startup!$C$5)+IF(F316=8,0,Startup!$C$6)+IF(G316=10,0,Startup!$C$7)+IF(H316=12,0,Startup!$C$8)+IF(I316=14,0,Startup!$C$9)","v":0},"No"]
[31.5,0,2,4,6,8,10,12,14,{"$f":"IF(B317=0,0,Startup!$C$2)+IF(C317=2,0,Startup!$C$3)+IF(D317=4,0,Startup!$C$4)+IF(E317=6,0,Startup!$C$5)+IF(F317=8,0,Startup!$C$6)+IF(G317=10,0,Startup!$C$7)+IF(H317=12,0,Startup!$C$8)+IF(I317=14,0,Startup!$C$9)","v":0},"No"]
[31.6,0,2,4,6,8,10,12,14,{"$f":"IF(B318=0,0,Startup!$C$2)+IF(C318=2,0,Startup!$C$3)+IF(D318=4,0,Startup!$C$4)+IF(E318=6,0,Startup!$C$5)+IF(F318=8,0,Startup!$C$6)+IF(G318=10,0,Startup!$C$7)+IF(H318=12,0,Startup!$C$8)+IF(I318=14,0,Startup!$C$9)","v":0},"No"]
[31.7,0,2,4,6,8,10,12,14,{"$f":"IF(B319=0,0,Startup!$C$2)+IF(C319=2,0,Startup!$C$3)+IF(D319=4,0,Startup!$C$4)+IF(E319=6,0,Startup!$C$5)+IF(F319=8,0,Startup!$C$6)+IF(G319=10,0,Startup!$C$7)+IF(H319=12,0,Startup!$C$8)+IF(I319=14,0,Startup!$C$9)","v":0},"No"]
[31.8,0,2,4,6,8,10,12,14,{"$f":"IF(B320=0,0,Startup!$C$2)+IF(C320=2,0,Startup!$C$3)+IF(D320=4,0,Startup!$C$4)+IF(E320=6,0,Startup!$C$5)+IF(F320=8,0,Startup!$C$6)+IF(G320=10,0,Startup!$C$7)+IF(H320=12,0,Startup!$C$8)+IF(I320=14,0,Startup!$C$9)","v":0},"No"]
[31.9,0,2,4,6,8,10,12,14,{"$f":"IF(B321=0,0,Startup!$C$2)+IF(C321=2,0,Startup!$C$3)+IF(D321=4,0,Startup!$C$4)+IF(E321=6,0,Startup!$C$5)+IF(F321=8,0,Startup!$C$6)+IF(G321=10,0,Startup!$C$7)+IF(H321=12,0,Startup!$C$8)+IF(I321=14,0,Startup!$C$9)","v":0},"No"]
[32,0,2,4,6,8,10,12,14,{"$f":"IF(B322=0,0,Startup!$C$2)+IF(C322=2,0,Startup!$C$3)+IF(D322=4,0,Startup!$C$4)+IF(E322=6,0,Startup!$C$5)+IF(F322=8,0,Startup!$C$6)+IF(G322=10,0,Startup!$C$7)+IF(H322=12,0,Startup!$C$8)+IF(I322=14,0,Startup!$C$9)","v":0},"No"]
[32.1,0,2,4,6,8,10,12,14,{"$f":"IF(B323=0,0,Startup!$C$2)+IF(C323=2,0,Startup!$C$3)+IF(D323=4,0,Startup!$C$4)+IF(E323=6,0,Startup!$C$5)+IF(F323=8,0,Startup!$C$6)+IF(G323=10,0,Startup!$C$7)+IF(H323=12,0,Startup!$C$8)+IF(I323=14,0,Startup!$C$9)","v":0},"No"]
[32.200000000000003,0,2,4,6,8,10,12,14,{"$f":"IF(B324=0,0,Startup!$C$2)+IF(C324=2,0,Startup!$C$3)+IF(D324=4,0,Startup!$C$4)+IF(E324=6,0,Startup!$C$5)+IF(F324=8,0,Startup!$C$6)+IF(G324=10,0,Startup!$C$7)+IF(H324=12,0,Startup!$C$8)+IF(I324=14,0,Startup!$C$9)","v":0},{"$f":"IF(J324<>J323,\"Yes\",\"No\")","v":"No"}]
[32.299999999999997,0,2,4,6,8,10,12,14,{"$f":"IF(B325=0,0,Startup!$C$2)+IF(C325=2,0,Startup!$C$3)+IF(D325=4,0,Startup!$C$4)+IF(E325=6,0,Startup!$C$5)+IF(F325=8,0,Startup!$C$6)+IF(G325=10,0,Startup!$C$7)+IF(H325=12,0,Startup!$C$8)+IF(I325=14,0,Startup!$C$9)","v":0},"No"]
[32.4,0,2,4,6,8,10,12,14,{"$f":"IF(B326=0,0,Startup!$C$2)+IF(C326=2,0,Startup!$C$3)+IF(D326=4,0,Startup!$C$4)+IF(E326=6,0,Startup!$C$5)+IF(F326=8,0,Startup!$C$6)+IF(G326=10,0,Startup!$C$7)+IF(H326=12,0,Startup!$C$8)+IF(I326=14,0,Startup!$C$9)","v":0},"No"]
[32.5,0,2,4,6,8,10,12,14,{"$f":"IF(B327=0,0,Startup!$C$2)+IF(C327=2,0,Startup!$C$3)+IF(D327=4,0,Startup!$C$4)+IF(E327=6,0,Startup!$C$5)+IF(F327=8,0,Startup!$C$6)+IF(G327=10,0,Startup!$C$7)+IF(H327=12,0,Startup!$C$8)+IF(I327=14,0,Startup!$C$9)","v":0},"No"]
[32.6,0,2,4,6,8,10,12,14,{"$f":"IF(B328=0,0,Startup!$C$2)+IF(C328=2,0,Startup!$C$3)+IF(D328=4,0,Startup!$C$4)+IF(E328=6,0,Startup!$C$5)+IF(F328=8,0,Startup!$C$6)+IF(G328=10,0,Startup!$C$7)+IF(H328=12,0,Startup!$C$8)+IF(I328=14,0,Startup!$C$9)","v":0},"No"]
[32.700000000000003,0,2,4,6,8,10,12,14,{"$f":"IF(B329=0,0,Startup!$C$2)+IF(C329=2,0,Startup!$C$3)+IF(D329=4,0,Startup!$C$4)+IF(E329=6,0,Startup!$C$5)+IF(F329=8,0,Startup!$C$6)+IF(G329=10,0,Startup!$C$7)+IF(H329=12,0,Startup!$C$8)+IF(I329=14,0,Startup!$C$9)","v":0},"No"]
[32.799999999999997,0,2,4,6,8,10,12,14,{"$f":"IF(B330=0,0,Startup!$C$2)+IF(C330=2,0,Startup!$C$3)+IF(D330=4,0,Startup!$C$4)+IF(E330=6,0,Startup!$C$5)+IF(F330=8,0,Startup!$C$6)+IF(G330=10,0,Startup!$C$7)+IF(H330=12,0,Startup!$C$8)+IF(I330=14,0,Startup!$C$9)","v":0},"No"]
[32.9,0,2,4,6,8,10,12,14,{"$f":"IF(B331=0,0,Startup!$C$2)+IF(C331=2,0,Startup!$C$3)+IF(D331=4,0,Startup!$C$4)+IF(E331=6,0,Startup!$C$5)+IF(F331=8,0,Startup!$C$6)+IF(G331=10,0,Startup!$C$7)+IF(H331=12,0,Startup!$C$8)+IF(I331=14,0,Startup!$C$9)","v":0},"No"]
[33,0,2,4,6,8,10,12,14,{"$f":"IF(B332=0,0,Startup!$C$2)+IF(C332=2,0,Startup!$C$3)+IF(D332=4,0,Startup!$C$4)+IF(E332=6,0,Startup!$C$5)+IF(F332=8,0,Startup!$C$6)+IF(G332=10,0,Startup!$C$7)+IF(H332=12,0,Startup!$C$8)+IF(I332=14,0,Startup!$C$9)","v":0},"No"]
[33.1,0,2,4,6,8,10,12,14,{"$f":"IF(B333=0,0,Startup!$C$2)+IF(C333=2,0,Startup!$C$3)+IF(D333=4,0,Startup!$C$4)+IF(E333=6,0,Startup!$C$5)+IF(F333=8,0,Startup!$C$6)+IF(G333=10,0,Startup!$C$7)+IF(H333=12,0,Startup!$C$8)+IF(I333=14,0,Startup!$C$9)","v":0},"No"]
[33.200000000000003,0,2,4,6,8,10,12,14,{"$f":"IF(B334=0,0,Startup!$C$2)+IF(C334=2,0,Startup!$C$3)+IF(D334=4,0,Startup!$C$4)+IF(E334=6,0,Startup!$C$5)+IF(F334=8,0,Startup!$C$6)+IF(G334=10,0,Startup!$C$7)+IF(H334=12,0,Startup!$C$8)+IF(I334=14,0,Startup!$C$9)","v":0},"No"]
[33.299999999999997,0,2,4,6,8,10,12,14,{"$f":"IF(B335=0,0,Startup!$C$2)+IF(C335=2,0,Startup!$C$3)+IF(D335=4,0,Startup!$C$4)+IF(E335=6,0,Startup!$C$5)+IF(F335=8,0,Startup!$C$6)+IF(G335=10,0,Startup!$C$7)+IF(H335=12,0,Startup!$C$8)+IF(I335=14,0,Startup!$C$9)","v":0},"No"]
[33.4,0,2,4,6,8,10,12,14,{"$f":"IF(B336=0,0,Startup!$C$2)+IF(C336=2,0,Startup!$C$3)+IF(D336=4,0,Startup!$C$4)+IF(E336=6,0,Startup!$C$5)+IF(F336=8,0,Startup!$C$6)+IF(G336=10,0,Startup!$C$7)+IF(H336=12,0,Startup!$C$8)+IF(I336=14,0,Startup!$C$9)","v":0},"No"]
[33.5,0,2,4,6,8,10,12,14,{"$f":"IF(B337=0,0,Startup!$C$2)+IF(C337=2,0,Startup!$C$3)+IF(D337=4,0,Startup!$C$4)+IF(E337=6,0,Startup!$C$5)+IF(F337=8,0,Startup!$C$6)+IF(G337=10,0,Startup!$C$7)+IF(H337=12,0,Startup!$C$8)+IF(I337=14,0,Startup!$C$9)","v":0},"No"]
[33.6,0,2,4,6,8,10,12,14,{"$f":"IF(B338=0,0,Startup!$C$2)+IF(C338=2,0,Startup!$C$3)+IF(D338=4,0,Startup!$C$4)+IF(E338=6,0,Startup!$C$5)+IF(F338=8,0,Startup!$C$6)+IF(G338=10,0,Startup!$C$7)+IF(H338=12,0,Startup!$C$8)+IF(I338=14,0,Startup!$C$9)","v":0},"No"]
[33.700000000000003,0,2,4,6,8,10,12,14,{"$f":"IF(B339=0,0,Startup!$C$2)+IF(C339=2,0,Startup!$C$3)+IF(D339=4,0,Startup!$C$4)+IF(E339=6,0,Startup!$C$5)+IF(F339=8,0,Startup!$C$6)+IF(G339=10,0,Startup!$C$7)+IF(H339=12,0,Startup!$C$8)+IF(I339=14,0,Startup!$C$9)","v":0},"No"]
[33.799999999999997,0,2,4,6,8,10,12,14,{"$f":"IF(B340=0,0,Startup!$C$2)+IF(C340=2,0,Startup!$C$3)+IF(D340=4,0,Startup!$C$4)+IF(E340=6,0,Startup!$C$5)+IF(F340=8,0,Startup!$C$6)+IF(G340=10,0,Startup!$C$7)+IF(H340=12,0,Startup!$C$8)+IF(I340=14,0,Startup!$C$9)","v":0},"No"]
[33.9,0,2,4,6,8,10,12,14,{"$f":"IF(B341=0,0,Startup!$C$2)+IF(C341=2,0,Startup!$C$3)+IF(D341=4,0,Startup!$C$4)+IF(E341=6,0,Startup!$C$5)+IF(F341=8,0,Startup!$C$6)+IF(G341=10,0,Startup!$C$7)+IF(H341=12,0,Startup!$C$8)+IF(I341=14,0,Startup!$C$9)","v":0},"No"]
[34,0,2,4,6,8,10,12,14,{"$f":"IF(B342=0,0,Startup!$C$2)+IF(C342=2,0,Startup!$C$3)+IF(D342=4,0,Startup!$C$4)+IF(E342=6,0,Startup!$C$5)+IF(F342=8,0,Startup!$C$6)+IF(G342=10,0,Startup!$C$7)+IF(H342=12,0,Startup!$C$8)+IF(I342=14,0,Startup!$C$9)","v":0},"No"]
[34.1,0,2,4,6,8,10,12,14,{"$f":"IF(B343=0,0,Startup!$C$2)+IF(C343=2,0,Startup!$C$3)+IF(D343=4,0,Startup!$C$4)+IF(E343=6,0,Startup!$C$5)+IF(F343=8,0,Startup!$C$6)+IF(G343=10,0,Startup!$C$7)+IF(H343=12,0,Startup!$C$8)+IF(I343=14,0,Startup!$C$9)","v":0},"No"]
[34.200000000000003,0,2,4,6,8,10,12,14,{"$f":"IF(B344=0,0,Startup!$C$2)+IF(C344=2,0,Startup!$C$3)+IF(D344=4,0,Startup!$C$4)+IF(E344=6,0,Startup!$C$5)+IF(F344=8,0,Startup!$C$6)+IF(G344=10,0,Startup!$C$7)+IF(H344=12,0,Startup!$C$8)+IF(I344=14,0,Startup!$C$9)","v":0},"No"]
[34.299999999999997,0,2,4,6,8,10,12,14,{"$f":"IF(B345=0,0,Startup!$C$2)+IF(C345=2,0,Startup!$C$3)+IF(D345=4,0,Startup!$C$4)+IF(E345=6,0,Startup!$C$5)+IF(F345=8,0,Startup!$C$6)+IF(G345=10,0,Startup!$C$7)+IF(H345=12,0,Startup!$C$8)+IF(I345=14,0,Startup!$C$9)","v":0},"No"]
[34.4,0,2,4,6,8,10,12,14,{"$f":"IF(B346=0,0,Startup!$C$2)+IF(C346=2,0,Startup!$C$3)+IF(D346=4,0,Startup!$C$4)+IF(E346=6,0,Startup!$C$5)+IF(F346=8,0,Startup!$C$6)+IF(G346=10,0,Startup!$C$7)+IF(H346=12,0,Startup!$C$8)+IF(I346=14,0,Startup!$C$9)","v":0},"No"]
[34.5,0,2,4,6,8,10,12,14,{"$f":"IF(B347=0,0,Startup!$C$2)+IF(C347=2,0,Startup!$C$3)+IF(D347=4,0,Startup!$C$4)+IF(E347=6,0,Startup!$C$5)+IF(F347=8,0,Startup!$C$6)+IF(G347=10,0,Startup!$C$7)+IF(H347=12,0,Startup!$C$8)+IF(I347=14,0,Startup!$C$9)","v":0},"No"]
[34.6,0,2,4,6,8,10,12,14,{"$f":"IF(B348=0,0,Startup!$C$2)+IF(C348=2,0,Startup!$C$3)+IF(D348=4,0,Startup!$C$4)+IF(E348=6,0,Startup!$C$5)+IF(F348=8,0,Startup!$C$6)+IF(G348=10,0,Startup!$C$7)+IF(H348=12,0,Startup!$C$8)+IF(I348=14,0,Startup!$C$9)","v":0},"No"]
[34.700000000000003,0,2,4,6,8,10,12,14,{"$f":"IF(B349=0,0,Startup!$C$2)+IF(C349=2,0,Startup!$C$3)+IF(D349=4,0,Startup!$C$4)+IF(E349=6,0,Startup!$C$5)+IF(F349=8,0,Startup!$C$6)+IF(G349=10,0,Startup!$C$7)+IF(H349=12,0,Startup!$C$8)+IF(I349=14,0,Startup!$C$9)","v":0},"No"]
[34.799999999999997,0,2,4,6,8,10,12,14,{"$f":"IF(B350=0,0,Startup!$C$2)+IF(C350=2,0,Startup!$C$3)+IF(D350=4,0,Startup!$C$4)+IF(E350=6,0,Startup!$C$5)+IF(F350=8,0,Startup!$C$6)+IF(G350=10,0,Startup!$C$7)+IF(H350=12,0,Startup!$C$8)+IF(I350=14,0,Startup!$C$9)","v":0},"No"]
[34.9,0,2,4,6,8,10,12,14,{"$f":"IF(B351=0,0,Startup!$C$2)+IF(C351=2,0,Startup!$C$3)+IF(D351=4,0,Startup!$C$4)+IF(E351=6,0,Startup!$C$5)+IF(F351=8,0,Startup!$C$6)+IF(G351=10,0,Startup!$C$7)+IF(H351=12,0,Startup!$C$8)+IF(I351=14,0,Startup!$C$9)","v":0},"No"]
[35,0,2,4,6,8,10,12,14,{"$f":"IF(B352=0,0,Startup!$C$2)+IF(C352=2,0,Startup!$C$3)+IF(D352=4,0,Startup!$C$4)+IF(E352=6,0,Startup!$C$5)+IF(F352=8,0,Startup!$C$6)+IF(G352=10,0,Startup!$C$7)+IF(H352=12,0,Startup!$C$8)+IF(I352=14,0,Startup!$C$9)","v":0},"No"]
[35.1,0,2,4,6,8,10,12,14,{"$f":"IF(B353=0,0,Startup!$C$2)+IF(C353=2,0,Startup!$C$3)+IF(D353=4,0,Startup!$C$4)+IF(E353=6,0,Startup!$C$5)+IF(F353=8,0,Startup!$C$6)+IF(G353=10,0,Startup!$C$7)+IF(H353=12,0,Startup!$C$8)+IF(I353=14,0,Startup!$C$9)","v":0},"No"]
[35.200000000000003,0,2,4,6,8,10,12,14,{"$f":"IF(B354=0,0,Startup!$C$2)+IF(C354=2,0,Startup!$C$3)+IF(D354=4,0,Startup!$C$4)+IF(E354=6,0,Startup!$C$5)+IF(F354=8,0,Startup!$C$6)+IF(G354=10,0,Startup!$C$7)+IF(H354=12,0,Startup!$C$8)+IF(I354=14,0,Startup!$C$9)","v":0},"No"]
[35.299999999999997,0,2,4,6,8,10,12,14,{"$f":"IF(B355=0,0,Startup!$C$2)+IF(C355=2,0,Startup!$C$3)+IF(D355=4,0,Startup!$C$4)+IF(E355=6,0,Startup!$C$5)+IF(F355=8,0,Startup!$C$6)+IF(G355=10,0,Startup!$C$7)+IF(H355=12,0,Startup!$C$8)+IF(I355=14,0,Startup!$C$9)","v":0},"No"]
[35.4,0,2,4,6,8,10,12,14,{"$f":"IF(B356=0,0,Startup!$C$2)+IF(C356=2,0,Startup!$C$3)+IF(D356=4,0,Startup!$C$4)+IF(E356=6,0,Startup!$C$5)+IF(F356=8,0,Startup!$C$6)+IF(G356=10,0,Startup!$C$7)+IF(H356=12,0,Startup!$C$8)+IF(I356=14,0,Startup!$C$9)","v":0},"No"]
[35.5,0,2,4,6,8,10,12,14,{"$f":"IF(B357=0,0,Startup!$C$2)+IF(C357=2,0,Startup!$C$3)+IF(D357=4,0,Startup!$C$4)+IF(E357=6,0,Startup!$C$5)+IF(F357=8,0,Startup!$C$6)+IF(G357=10,0,Startup!$C$7)+IF(H357=12,0,Startup!$C$8)+IF(I357=14,0,Startup!$C$9)","v":0},"No"]
[35.6,0,2,4,6,8,10,12,14,{"$f":"IF(B358=0,0,Startup!$C$2)+IF(C358=2,0,Startup!$C$3)+IF(D358=4,0,Startup!$C$4)+IF(E358=6,0,Startup!$C$5)+IF(F358=8,0,Startup!$C$6)+IF(G358=10,0,Startup!$C$7)+IF(H358=12,0,Startup!$C$8)+IF(I358=14,0,Startup!$C$9)","v":0},"No"]
[35.700000000000003,0,2,4,6,8,10,12,14,{"$f":"IF(B359=0,0,Startup!$C$2)+IF(C359=2,0,Startup!$C$3)+IF(D359=4,0,Startup!$C$4)+IF(E359=6,0,Startup!$C$5)+IF(F359=8,0,Startup!$C$6)+IF(G359=10,0,Startup!$C$7)+IF(H359=12,0,Startup!$C$8)+IF(I359=14,0,Startup!$C$9)","v":0},"No"]
[35.799999999999997,0,2,4,6,8,10,12,14,{"$f":"IF(B360=0,0,Startup!$C$2)+IF(C360=2,0,Startup!$C$3)+IF(D360=4,0,Startup!$C$4)+IF(E360=6,0,Startup!$C$5)+IF(F360=8,0,Startup!$C$6)+IF(G360=10,0,Startup!$C$7)+IF(H360=12,0,Startup!$C$8)+IF(I360=14,0,Startup!$C$9)","v":0},"No"]
[35.9,0,2,4,6,8,10,12,14,{"$f":"IF(B361=0,0,Startup!$C$2)+IF(C361=2,0,Startup!$C$3)+IF(D361=4,0,Startup!$C$4)+IF(E361=6,0,Startup!$C$5)+IF(F361=8,0,Startup!$C$6)+IF(G361=10,0,Startup!$C$7)+IF(H361=12,0,Startup!$C$8)+IF(I361=14,0,Startup!$C$9)","v":0},"No"]
[36,0,2,4,6,8,10,12,14,{"$f":"IF(B362=0,0,Startup!$C$2)+IF(C362=2,0,Startup!$C$3)+IF(D362=4,0,Startup!$C$4)+IF(E362=6,0,Startup!$C$5)+IF(F362=8,0,Startup!$C$6)+IF(G362=10,0,Startup!$C$7)+IF(H362=12,0,Startup!$C$8)+IF(I362=14,0,Startup!$C$9)","v":0},"No"]
[36.1,0,2,4,6,8,10,12,14,{"$f":"IF(B363=0,0,Startup!$C$2)+IF(C363=2,0,Startup!$C$3)+IF(D363=4,0,Startup!$C$4)+IF(E363=6,0,Startup!$C$5)+IF(F363=8,0,Startup!$C$6)+IF(G363=10,0,Startup!$C$7)+IF(H363=12,0,Startup!$C$8)+IF(I363=14,0,Startup!$C$9)","v":0},"No"]
[36.200000000000003,0,2,4,6,8,10,12,14,{"$f":"IF(B364=0,0,Startup!$C$2)+IF(C364=2,0,Startup!$C$3)+IF(D364=4,0,Startup!$C$4)+IF(E364=6,0,Startup!$C$5)+IF(F364=8,0,Startup!$C$6)+IF(G364=10,0,Startup!$C$7)+IF(H364=12,0,Startup!$C$8)+IF(I364=14,0,Startup!$C$9)","v":0},"No"]
[36.299999999999997,0,2,4,6,8,10,12,14,{"$f":"IF(B365=0,0,Startup!$C$2)+IF(C365=2,0,Startup!$C$3)+IF(D365=4,0,Startup!$C$4)+IF(E365=6,0,Startup!$C$5)+IF(F365=8,0,Startup!$C$6)+IF(G365=10,0,Startup!$C$7)+IF(H365=12,0,Startup!$C$8)+IF(I365=14,0,Startup!$C$9)","v":0},"No"]
[36.4,0,2,4,6,8,10,12,14,{"$f":"IF(B366=0,0,Startup!$C$2)+IF(C366=2,0,Startup!$C$3)+IF(D366=4,0,Startup!$C$4)+IF(E366=6,0,Startup!$C$5)+IF(F366=8,0,Startup!$C$6)+IF(G366=10,0,Startup!$C$7)+IF(H366=12,0,Startup!$C$8)+IF(I366=14,0,Startup!$C$9)","v":0},"No"]
[36.5,0,2,4,6,8,10,12,14,{"$f":"IF(B367=0,0,Startup!$C$2)+IF(C367=2,0,Startup!$C$3)+IF(D367=4,0,Startup!$C$4)+IF(E367=6,0,Startup!$C$5)+IF(F367=8,0,Startup!$C$6)+IF(G367=10,0,Startup!$C$7)+IF(H367=12,0,Startup!$C$8)+IF(I367=14,0,Startup!$C$9)","v":0},"No"]
[36.6,0,2,4,6,8,10,12,14,{"$f":"IF(B368=0,0,Startup!$C$2)+IF(C368=2,0,Startup!$C$3)+IF(D368=4,0,Startup!$C$4)+IF(E368=6,0,Startup!$C$5)+IF(F368=8,0,Startup!$C$6)+IF(G368=10,0,Startup!$C$7)+IF(H368=12,0,Startup!$C$8)+IF(I368=14,0,Startup!$C$9)","v":0},"No"]
[36.700000000000003,0,2,4,6,8,10,12,14,{"$f":"IF(B369=0,0,Startup!$C$2)+IF(C369=2,0,Startup!$C$3)+IF(D369=4,0,Startup!$C$4)+IF(E369=6,0,Startup!$C$5)+IF(F369=8,0,Startup!$C$6)+IF(G369=10,0,Startup!$C$7)+IF(H369=12,0,Startup!$C$8)+IF(I369=14,0,Startup!$C$9)","v":0},"No"]
[36.799999999999997,0,2,4,6,8,10,12,14,{"$f":"IF(B370=0,0,Startup!$C$2)+IF(C370=2,0,Startup!$C$3)+IF(D370=4,0,Startup!$C$4)+IF(E370=6,0,Startup!$C$5)+IF(F370=8,0,Startup!$C$6)+IF(G370=10,0,Startup!$C$7)+IF(H370=12,0,Startup!$C$8)+IF(I370=14,0,Startup!$C$9)","v":0},"No"]
[36.9,0,2,4,6,8,10,12,14,{"$f":"IF(B371=0,0,Startup!$C$2)+IF(C371=2,0,Startup!$C$3)+IF(D371=4,0,Startup!$C$4)+IF(E371=6,0,Startup!$C$5)+IF(F371=8,0,Startup!$C$6)+IF(G371=10,0,Startup!$C$7)+IF(H371=12,0,Startup!$C$8)+IF(I371=14,0,Startup!$C$9)","v":0},"No"]
[37,0,2,4,6,8,10,12,14,{"$f":"IF(B372=0,0,Startup!$C$2)+IF(C372=2,0,Startup!$C$3)+IF(D372=4,0,Startup!$C$4)+IF(E372=6,0,Startup!$C$5)+IF(F372=8,0,Startup!$C$6)+IF(G372=10,0,Startup!$C$7)+IF(H372=12,0,Startup!$C$8)+IF(I372=14,0,Startup!$C$9)","v":0},"No"]
[37.1,0,2,4,6,8,10,12,14,{"$f":"IF(B373=0,0,Startup!$C$2)+IF(C373=2,0,Startup!$C$3)+IF(D373=4,0,Startup!$C$4)+IF(E373=6,0,Startup!$C$5)+IF(F373=8,0,Startup!$C$6)+IF(G373=10,0,Startup!$C$7)+IF(H373=12,0,Startup!$C$8)+IF(I373=14,0,Startup!$C$9)","v":0},"No"]
[37.200000000000003,0,2,4,6,8,10,12,14,{"$f":"IF(B374=0,0,Startup!$C$2)+IF(C374=2,0,Startup!$C$3)+IF(D374=4,0,Startup!$C$4)+IF(E374=6,0,Startup!$C$5)+IF(F374=8,0,Startup!$C$6)+IF(G374=10,0,Startup!$C$7)+IF(H374=12,0,Startup!$C$8)+IF(I374=14,0,Startup!$C$9)","v":0},"No"]
[37.299999999999997,0,2,4,6,8,10,12,14,{"$f":"IF(B375=0,0,Startup!$C$2)+IF(C375=2,0,Startup!$C$3)+IF(D375=4,0,Startup!$C$4)+IF(E375=6,0,Startup!$C$5)+IF(F375=8,0,Startup!$C$6)+IF(G375=10,0,Startup!$C$7)+IF(H375=12,0,Startup!$C$8)+IF(I375=14,0,Startup!$C$9)","v":0},"No"]
[37.4,0,2,4,6,8,10,12,14,{"$f":"IF(B376=0,0,Startup!$C$2)+IF(C376=2,0,Startup!$C$3)+IF(D376=4,0,Startup!$C$4)+IF(E376=6,0,Startup!$C$5)+IF(F376=8,0,Startup!$C$6)+IF(G376=10,0,Startup!$C$7)+IF(H376=12,0,Startup!$C$8)+IF(I376=14,0,Startup!$C$9)","v":0},"No"]
[37.5,0,2,4,6,8,10,12,14,{"$f":"IF(B377=0,0,Startup!$C$2)+IF(C377=2,0,Startup!$C$3)+IF(D377=4,0,Startup!$C$4)+IF(E377=6,0,Startup!$C$5)+IF(F377=8,0,Startup!$C$6)+IF(G377=10,0,Startup!$C$7)+IF(H377=12,0,Startup!$C$8)+IF(I377=14,0,Startup!$C$9)","v":0},"No"]
[37.6,0,2,4,6,8,10,12,14,{"$f":"IF(B378=0,0,Startup!$C$2)+IF(C378=2,0,Startup!$C$3)+IF(D378=4,0,Startup!$C$4)+IF(E378=6,0,Startup!$C$5)+IF(F378=8,0,Startup!$C$6)+IF(G378=10,0,Startup!$C$7)+IF(H378=12,0,Startup!$C$8)+IF(I378=14,0,Startup!$C$9)","v":0},"No"]
[37.700000000000003,0,2,4,6,8,10,12,14,{"$f":"IF(B379=0,0,Startup!$C$2)+IF(C379=2,0,Startup!$C$3)+IF(D379=4,0,Startup!$C$4)+IF(E379=6,0,Startup!$C$5)+IF(F379=8,0,Startup!$C$6)+IF(G379=10,0,Startup!$C$7)+IF(H379=12,0,Startup!$C$8)+IF(I379=14,0,Startup!$C$9)","v":0},"No"]
[37.799999999999997,0,2,4,6,8,10,12,14,{"$f":"IF(B380=0,0,Startup!$C$2)+IF(C380=2,0,Startup!$C$3)+IF(D380=4,0,Startup!$C$4)+IF(E380=6,0,Startup!$C$5)+IF(F380=8,0,Startup!$C$6)+IF(G380=10,0,Startup!$C$7)+IF(H380=12,0,Startup!$C$8)+IF(I380=14,0,Startup!$C$9)","v":0},"No"]
[37.9,0,2,4,6,8,10,12,14,{"$f":"IF(B381=0,0,Startup!$C$2)+IF(C381=2,0,Startup!$C$3)+IF(D381=4,0,Startup!$C$4)+IF(E381=6,0,Startup!$C$5)+IF(F381=8,0,Startup!$C$6)+IF(G381=10,0,Startup!$C$7)+IF(H381=12,0,Startup!$C$8)+IF(I381=14,0,Startup!$C$9)","v":0},"No"]
[38,0,2,4,6,8,10,12,14,{"$f":"IF(B382=0,0,Startup!$C$2)+IF(C382=2,0,Startup!$C$3)+IF(D382=4,0,Startup!$C$4)+IF(E382=6,0,Startup!$C$5)+IF(F382=8,0,Startup!$C$6)+IF(G382=10,0,Startup!$C$7)+IF(H382=12,0,Startup!$C$8)+IF(I382=14,0,Startup!$C$9)","v":0},"No"]
[38.1,0,2,4,6,8,10,12,14,{"$f":"IF(B383=0,0,Startup!$C$2)+IF(C383=2,0,Startup!$C$3)+IF(D383=4,0,Startup!$C$4)+IF(E383=6,0,Startup!$C$5)+IF(F383=8,0,Startup!$C$6)+IF(G383=10,0,Startup!$C$7)+IF(H383=12,0,Startup!$C$8)+IF(I383=14,0,Startup!$C$9)","v":0},"No"]
[38.200000000000003,0,2,4,6,8,10,12,14,{"$f":"IF(B384=0,0,Startup!$C$2)+IF(C384=2,0,Startup!$C$3)+IF(D384=4,0,Startup!$C$4)+IF(E384=6,0,Startup!$C$5)+IF(F384=8,0,Startup!$C$6)+IF(G384=10,0,Startup!$C$7)+IF(H384=12,0,Startup!$C$8)+IF(I384=14,0,Startup!$C$9)","v":0},"No"]
[38.299999999999997,0,2,4,6,8,10,12,14,{"$f":"IF(B385=0,0,Startup!$C$2)+IF(C385=2,0,Startup!$C$3)+IF(D385=4,0,Startup!$C$4)+IF(E385=6,0,Startup!$C$5)+IF(F385=8,0,Startup!$C$6)+IF(G385=10,0,Startup!$C$7)+IF(H385=12,0,Startup!$C$8)+IF(I385=14,0,Startup!$C$9)","v":0},"No"]
[38.4,0,2,4,6,8,10,12,14,{"$f":"IF(B386=0,0,Startup!$C$2)+IF(C386=2,0,Startup!$C$3)+IF(D386=4,0,Startup!$C$4)+IF(E386=6,0,Startup!$C$5)+IF(F386=8,0,Startup!$C$6)+IF(G386=10,0,Startup!$C$7)+IF(H386=12,0,Startup!$C$8)+IF(I386=14,0,Startup!$C$9)","v":0},"No"]
[38.5,0,2,4,6,8,10,12,14,{"$f":"IF(B387=0,0,Startup!$C$2)+IF(C387=2,0,Startup!$C$3)+IF(D387=4,0,Startup!$C$4)+IF(E387=6,0,Startup!$C$5)+IF(F387=8,0,Startup!$C$6)+IF(G387=10,0,Startup!$C$7)+IF(H387=12,0,Startup!$C$8)+IF(I387=14,0,Startup!$C$9)","v":0},"No"]
[38.6,0,2,4,6,8,10,12,14,{"$f":"IF(B388=0,0,Startup!$C$2)+IF(C388=2,0,Startup!$C$3)+IF(D388=4,0,Startup!$C$4)+IF(E388=6,0,Startup!$C$5)+IF(F388=8,0,Startup!$C$6)+IF(G388=10,0,Startup!$C$7)+IF(H388=12,0,Startup!$C$8)+IF(I388=14,0,Startup!$C$9)","v":0},{"$f":"IF(J388<>J387,\"Yes\",\"No\")","v":"No"}]
[38.700000000000003,0,2,4,6,8,10,12,14,{"$f":"IF(B389=0,0,Startup!$C$2)+IF(C389=2,0,Startup!$C$3)+IF(D389=4,0,Startup!$C$4)+IF(E389=6,0,Startup!$C$5)+IF(F389=8,0,Startup!$C$6)+IF(G389=10,0,Startup!$C$7)+IF(H389=12,0,Startup!$C$8)+IF(I389=14,0,Startup!$C$9)","v":0},"No"]
[38.799999999999997,0,2,4,6,8,10,12,14,{"$f":"IF(B390=0,0,Startup!$C$2)+IF(C390=2,0,Startup!$C$3)+IF(D390=4,0,Startup!$C$4)+IF(E390=6,0,Startup!$C$5)+IF(F390=8,0,Startup!$C$6)+IF(G390=10,0,Startup!$C$7)+IF(H390=12,0,Startup!$C$8)+IF(I390=14,0,Startup!$C$9)","v":0},"No"]
[38.9,0,2,4,6,8,10,12,14,{"$f":"IF(B391=0,0,Startup!$C$2)+IF(C391=2,0,Startup!$C$3)+IF(D391=4,0,Startup!$C$4)+IF(E391=6,0,Startup!$C$5)+IF(F391=8,0,Startup!$C$6)+IF(G391=10,0,Startup!$C$7)+IF(H391=12,0,Startup!$C$8)+IF(I391=14,0,Startup!$C$9)","v":0},"No"]
[39,0,2,4,6,8,10,12,14,{"$f":"IF(B392=0,0,Startup!$C$2)+IF(C392=2,0,Startup!$C$3)+IF(D392=4,0,Startup!$C$4)+IF(E392=6,0,Startup!$C$5)+IF(F392=8,0,Startup!$C$6)+IF(G392=10,0,Startup!$C$7)+IF(H392=12,0,Startup!$C$8)+IF(I392=14,0,Startup!$C$9)","v":0},"No"]
[39.1,0,2,4,6,8,10,12,14,{"$f":"IF(B393=0,0,Startup!$C$2)+IF(C393=2,0,Startup!$C$3)+IF(D393=4,0,Startup!$C$4)+IF(E393=6,0,Startup!$C$5)+IF(F393=8,0,Startup!$C$6)+IF(G393=10,0,Startup!$C$7)+IF(H393=12,0,Startup!$C$8)+IF(I393=14,0,Startup!$C$9)","v":0},"No"]
[39.200000000000003,0,2,4,6,8,10,12,14,{"$f":"IF(B394=0,0,Startup!$C$2)+IF(C394=2,0,Startup!$C$3)+IF(D394=4,0,Startup!$C$4)+IF(E394=6,0,Startup!$C$5)+IF(F394=8,0,Startup!$C$6)+IF(G394=10,0,Startup!$C$7)+IF(H394=12,0,Startup!$C$8)+IF(I394=14,0,Startup!$C$9)","v":0},"No"]
[39.299999999999997,0,2,4,6,8,10,12,14,{"$f":"IF(B395=0,0,Startup!$C$2)+IF(C395=2,0,Startup!$C$3)+IF(D395=4,0,Startup!$C$4)+IF(E395=6,0,Startup!$C$5)+IF(F395=8,0,Startup!$C$6)+IF(G395=10,0,Startup!$C$7)+IF(H395=12,0,Startup!$C$8)+IF(I395=14,0,Startup!$C$9)","v":0},"No"]
[39.4,0,2,4,6,8,10,12,14,{"$f":"IF(B396=0,0,Startup!$C$2)+IF(C396=2,0,Startup!$C$3)+IF(D396=4,0,Startup!$C$4)+IF(E396=6,0,Startup!$C$5)+IF(F396=8,0,Startup!$C$6)+IF(G396=10,0,Startup!$C$7)+IF(H396=12,0,Startup!$C$8)+IF(I396=14,0,Startup!$C$9)","v":0},"No"]
[39.5,0,2,4,6,8,10,12,14,{"$f":"IF(B397=0,0,Startup!$C$2)+IF(C397=2,0,Startup!$C$3)+IF(D397=4,0,Startup!$C$4)+IF(E397=6,0,Startup!$C$5)+IF(F397=8,0,Startup!$C$6)+IF(G397=10,0,Startup!$C$7)+IF(H397=12,0,Startup!$C$8)+IF(I397=14,0,Startup!$C$9)","v":0},"No"]
[39.6,0,2,4,6,8,10,12,14,{"$f":"IF(B398=0,0,Startup!$C$2)+IF(C398=2,0,Startup!$C$3)+IF(D398=4,0,Startup!$C$4)+IF(E398=6,0,Startup!$C$5)+IF(F398=8,0,Startup!$C$6)+IF(G398=10,0,Startup!$C$7)+IF(H398=12,0,Startup!$C$8)+IF(I398=14,0,Startup!$C$9)","v":0},"No"]
[39.700000000000003,0,2,4,6,8,10,12,14,{"$f":"IF(B399=0,0,Startup!$C$2)+IF(C399=2,0,Startup!$C$3)+IF(D399=4,0,Startup!$C$4)+IF(E399=6,0,Startup!$C$5)+IF(F399=8,0,Startup!$C$6)+IF(G399=10,0,Startup!$C$7)+IF(H399=12,0,Startup!$C$8)+IF(I399=14,0,Startup!$C$9)","v":0},"No"]
[39.799999999999997,0,2,4,6,8,10,12,14,{"$f":"IF(B400=0,0,Startup!$C$2)+IF(C400=2,0,Startup!$C$3)+IF(D400=4,0,Startup!$C$4)+IF(E400=6,0,Startup!$C$5)+IF(F400=8,0,Startup!$C$6)+IF(G400=10,0,Startup!$C$7)+IF(H400=12,0,Startup!$C$8)+IF(I400=14,0,Startup!$C$9)","v":0},"No"]
[39.9,0,2,4,6,8,10,12,14,{"$f":"IF(B401=0,0,Startup!$C$2)+IF(C401=2,0,Startup!$C$3)+IF(D401=4,0,Startup!$C$4)+IF(E401=6,0,Startup!$C$5)+IF(F401=8,0,Startup!$C$6)+IF(G401=10,0,Startup!$C$7)+IF(H401=12,0,Startup!$C$8)+IF(I401=14,0,Startup!$C$9)","v":0},"No"]
[40,0,2,4,6,8,10,12,14,{"$f":"IF(B402=0,0,Startup!$C$2)+IF(C402=2,0,Startup!$C$3)+IF(D402=4,0,Startup!$C$4)+IF(E402=6,0,Startup!$C$5)+IF(F402=8,0,Startup!$C$6)+IF(G402=10,0,Startup!$C$7)+IF(H402=12,0,Startup!$C$8)+IF(I402=14,0,Startup!$C$9)","v":0},"No"]
[40.1,0,2,4,6,8,10,12,14,{"$f":"IF(B403=0,0,Startup!$C$2)+IF(C403=2,0,Startup!$C$3)+IF(D403=4,0,Startup!$C$4)+IF(E403=6,0,Startup!$C$5)+IF(F403=8,0,Startup!$C$6)+IF(G403=10,0,Startup!$C$7)+IF(H403=12,0,Startup!$C$8)+IF(I403=14,0,Startup!$C$9)","v":0},"No"]
[40.200000000000003,0,2,4,6,8,10,12,14,{"$f":"IF(B404=0,0,Startup!$C$2)+IF(C404=2,0,Startup!$C$3)+IF(D404=4,0,Startup!$C$4)+IF(E404=6,0,Startup!$C$5)+IF(F404=8,0,Startup!$C$6)+IF(G404=10,0,Startup!$C$7)+IF(H404=12,0,Startup!$C$8)+IF(I404=14,0,Startup!$C$9)","v":0},"No"]
[40.299999999999997,0,2,4,6,8,10,12,14,{"$f":"IF(B405=0,0,Startup!$C$2)+IF(C405=2,0,Startup!$C$3)+IF(D405=4,0,Startup!$C$4)+IF(E405=6,0,Startup!$C$5)+IF(F405=8,0,Startup!$C$6)+IF(G405=10,0,Startup!$C$7)+IF(H405=12,0,Startup!$C$8)+IF(I405=14,0,Startup!$C$9)","v":0},"No"]
[40.4,0,2,4,6,8,10,12,14,{"$f":"IF(B406=0,0,Startup!$C$2)+IF(C406=2,0,Startup!$C$3)+IF(D406=4,0,Startup!$C$4)+IF(E406=6,0,Startup!$C$5)+IF(F406=8,0,Startup!$C$6)+IF(G406=10,0,Startup!$C$7)+IF(H406=12,0,Startup!$C$8)+IF(I406=14,0,Startup!$C$9)","v":0},"No"]
[40.5,0,2,4,6,8,10,12,14,{"$f":"IF(B407=0,0,Startup!$C$2)+IF(C407=2,0,Startup!$C$3)+IF(D407=4,0,Startup!$C$4)+IF(E407=6,0,Startup!$C$5)+IF(F407=8,0,Startup!$C$6)+IF(G407=10,0,Startup!$C$7)+IF(H407=12,0,Startup!$C$8)+IF(I407=14,0,Startup!$C$9)","v":0},"No"]
[40.6,0,2,4,6,8,10,12,14,{"$f":"IF(B408=0,0,Startup!$C$2)+IF(C408=2,0,Startup!$C$3)+IF(D408=4,0,Startup!$C$4)+IF(E408=6,0,Startup!$C$5)+IF(F408=8,0,Startup!$C$6)+IF(G408=10,0,Startup!$C$7)+IF(H408=12,0,Startup!$C$8)+IF(I408=14,0,Startup!$C$9)","v":0},"No"]
[40.700000000000003,0,2,4,6,8,10,12,14,{"$f":"IF(B409=0,0,Startup!$C$2)+IF(C409=2,0,Startup!$C$3)+IF(D409=4,0,Startup!$C$4)+IF(E409=6,0,Startup!$C$5)+IF(F409=8,0,Startup!$C$6)+IF(G409=10,0,Startup!$C$7)+IF(H409=12,0,Startup!$C$8)+IF(I409=14,0,Startup!$C$9)","v":0},"No"]
[40.799999999999997,0,2,4,6,8,10,12,14,{"$f":"IF(B410=0,0,Startup!$C$2)+IF(C410=2,0,Startup!$C$3)+IF(D410=4,0,Startup!$C$4)+IF(E410=6,0,Startup!$C$5)+IF(F410=8,0,Startup!$C$6)+IF(G410=10,0,Startup!$C$7)+IF(H410=12,0,Startup!$C$8)+IF(I410=14,0,Startup!$C$9)","v":0},"No"]
[40.9,0,2,4,6,8,10,12,14,{"$f":"IF(B411=0,0,Startup!$C$2)+IF(C411=2,0,Startup!$C$3)+IF(D411=4,0,Startup!$C$4)+IF(E411=6,0,Startup!$C$5)+IF(F411=8,0,Startup!$C$6)+IF(G411=10,0,Startup!$C$7)+IF(H411=12,0,Startup!$C$8)+IF(I411=14,0,Startup!$C$9)","v":0},"No"]
[41,0,2,4,6,8,10,12,14,{"$f":"IF(B412=0,0,Startup!$C$2)+IF(C412=2,0,Startup!$C$3)+IF(D412=4,0,Startup!$C$4)+IF(E412=6,0,Startup!$C$5)+IF(F412=8,0,Startup!$C$6)+IF(G412=10,0,Startup!$C$7)+IF(H412=12,0,Startup!$C$8)+IF(I412=14,0,Startup!$C$9)","v":0},"No"]
[41.1,0,2,4,6,8,10,12,14,{"$f":"IF(B413=0,0,Startup!$C$2)+IF(C413=2,0,Startup!$C$3)+IF(D413=4,0,Startup!$C$4)+IF(E413=6,0,Startup!$C$5)+IF(F413=8,0,Startup!$C$6)+IF(G413=10,0,Startup!$C$7)+IF(H413=12,0,Startup!$C$8)+IF(I413=14,0,Startup!$C$9)","v":0},"No"]
[41.2,0,2,4,6,8,10,12,14,{"$f":"IF(B414=0,0,Startup!$C$2)+IF(C414=2,0,Startup!$C$3)+IF(D414=4,0,Startup!$C$4)+IF(E414=6,0,Startup!$C$5)+IF(F414=8,0,Startup!$C$6)+IF(G414=10,0,Startup!$C$7)+IF(H414=12,0,Startup!$C$8)+IF(I414=14,0,Startup!$C$9)","v":0},"No"]
[41.3,0,2,4,6,8,10,12,14,{"$f":"IF(B415=0,0,Startup!$C$2)+IF(C415=2,0,Startup!$C$3)+IF(D415=4,0,Startup!$C$4)+IF(E415=6,0,Startup!$C$5)+IF(F415=8,0,Startup!$C$6)+IF(G415=10,0,Startup!$C$7)+IF(H415=12,0,Startup!$C$8)+IF(I415=14,0,Startup!$C$9)","v":0},"No"]
[41.4,0,2,4,6,8,10,12,14,{"$f":"IF(B416=0,0,Startup!$C$2)+IF(C416=2,0,Startup!$C$3)+IF(D416=4,0,Startup!$C$4)+IF(E416=6,0,Startup!$C$5)+IF(F416=8,0,Startup!$C$6)+IF(G416=10,0,Startup!$C$7)+IF(H416=12,0,Startup!$C$8)+IF(I416=14,0,Startup!$C$9)","v":0},"No"]
[41.5,0,2,4,6,8,10,12,14,{"$f":"IF(B417=0,0,Startup!$C$2)+IF(C417=2,0,Startup!$C$3)+IF(D417=4,0,Startup!$C$4)+IF(E417=6,0,Startup!$C$5)+IF(F417=8,0,Startup!$C$6)+IF(G417=10,0,Startup!$C$7)+IF(H417=12,0,Startup!$C$8)+IF(I417=14,0,Startup!$C$9)","v":0},"No"]
[41.6,0,2,4,6,8,10,12,14,{"$f":"IF(B418=0,0,Startup!$C$2)+IF(C418=2,0,Startup!$C$3)+IF(D418=4,0,Startup!$C$4)+IF(E418=6,0,Startup!$C$5)+IF(F418=8,0,Startup!$C$6)+IF(G418=10,0,Startup!$C$7)+IF(H418=12,0,Startup!$C$8)+IF(I418=14,0,Startup!$C$9)","v":0},"No"]
[41.7,0,2,4,6,8,10,12,14,{"$f":"IF(B419=0,0,Startup!$C$2)+IF(C419=2,0,Startup!$C$3)+IF(D419=4,0,Startup!$C$4)+IF(E419=6,0,Startup!$C$5)+IF(F419=8,0,Startup!$C$6)+IF(G419=10,0,Startup!$C$7)+IF(H419=12,0,Startup!$C$8)+IF(I419=14,0,Startup!$C$9)","v":0},"No"]
[41.8,0,2,4,6,8,10,12,14,{"$f":"IF(B420=0,0,Startup!$C$2)+IF(C420=2,0,Startup!$C$3)+IF(D420=4,0,Startup!$C$4)+IF(E420=6,0,Startup!$C$5)+IF(F420=8,0,Startup!$C$6)+IF(G420=10,0,Startup!$C$7)+IF(H420=12,0,Startup!$C$8)+IF(I420=14,0,Startup!$C$9)","v":0},"No"]
[41.9,0,2,4,6,8,10,12,14,{"$f":"IF(B421=0,0,Startup!$C$2)+IF(C421=2,0,Startup!$C$3)+IF(D421=4,0,Startup!$C$4)+IF(E421=6,0,Startup!$C$5)+IF(F421=8,0,Startup!$C$6)+IF(G421=10,0,Startup!$C$7)+IF(H421=12,0,Startup!$C$8)+IF(I421=14,0,Startup!$C$9)","v":0},"No"]
[42,0,2,4,6,8,10,12,14,{"$f":"IF(B422=0,0,Startup!$C$2)+IF(C422=2,0,Startup!$C$3)+IF(D422=4,0,Startup!$C$4)+IF(E422=6,0,Startup!$C$5)+IF(F422=8,0,Startup!$C$6)+IF(G422=10,0,Startup!$C$7)+IF(H422=12,0,Startup!$C$8)+IF(I422=14,0,Startup!$C$9)","v":0},"No"]
[42.1,0,2,4,6,8,10,12,14,{"$f":"IF(B423=0,0,Startup!$C$2)+IF(C423=2,0,Startup!$C$3)+IF(D423=4,0,Startup!$C$4)+IF(E423=6,0,Startup!$C$5)+IF(F423=8,0,Startup!$C$6)+IF(G423=10,0,Startup!$C$7)+IF(H423=12,0,Startup!$C$8)+IF(I423=14,0,Startup!$C$9)","v":0},"No"]
[42.2,0,2,4,6,8,10,12,14,{"$f":"IF(B424=0,0,Startup!$C$2)+IF(C424=2,0,Startup!$C$3)+IF(D424=4,0,Startup!$C$4)+IF(E424=6,0,Startup!$C$5)+IF(F424=8,0,Startup!$C$6)+IF(G424=10,0,Startup!$C$7)+IF(H424=12,0,Startup!$C$8)+IF(I424=14,0,Startup!$C$9)","v":0},"No"]
[42.3,0,2,4,6,8,10,12,14,{"$f":"IF(B425=0,0,Startup!$C$2)+IF(C425=2,0,Startup!$C$3)+IF(D425=4,0,Startup!$C$4)+IF(E425=6,0,Startup!$C$5)+IF(F425=8,0,Startup!$C$6)+IF(G425=10,0,Startup!$C$7)+IF(H425=12,0,Startup!$C$8)+IF(I425=14,0,Startup!$C$9)","v":0},"No"]
[42.4,0,2,4,6,8,10,12,14,{"$f":"IF(B426=0,0,Startup!$C$2)+IF(C426=2,0,Startup!$C$3)+IF(D426=4,0,Startup!$C$4)+IF(E426=6,0,Startup!$C$5)+IF(F426=8,0,Startup!$C$6)+IF(G426=10,0,Startup!$C$7)+IF(H426=12,0,Startup!$C$8)+IF(I426=14,0,Startup!$C$9)","v":0},"No"]
[42.5,0,2,4,6,8,10,12,14,{"$f":"IF(B427=0,0,Startup!$C$2)+IF(C427=2,0,Startup!$C$3)+IF(D427=4,0,Startup!$C$4)+IF(E427=6,0,Startup!$C$5)+IF(F427=8,0,Startup!$C$6)+IF(G427=10,0,Startup!$C$7)+IF(H427=12,0,Startup!$C$8)+IF(I427=14,0,Startup!$C$9)","v":0},"No"]
[42.6,0,2,4,6,8,10,12,14,{"$f":"IF(B428=0,0,Startup!$C$2)+IF(C428=2,0,Startup!$C$3)+IF(D428=4,0,Startup!$C$4)+IF(E428=6,0,Startup!$C$5)+IF(F428=8,0,Startup!$C$6)+IF(G428=10,0,Startup!$C$7)+IF(H428=12,0,Startup!$C$8)+IF(I428=14,0,Startup!$C$9)","v":0},"No"]
[42.7,0,2,4,6,8,10,12,14,{"$f":"IF(B429=0,0,Startup!$C$2)+IF(C429=2,0,Startup!$C$3)+IF(D429=4,0,Startup!$C$4)+IF(E429=6,0,Startup!$C$5)+IF(F429=8,0,Startup!$C$6)+IF(G429=10,0,Startup!$C$7)+IF(H429=12,0,Startup!$C$8)+IF(I429=14,0,Startup!$C$9)","v":0},"No"]
[42.8,0,2,4,6,8,10,12,14,{"$f":"IF(B430=0,0,Startup!$C$2)+IF(C430=2,0,Startup!$C$3)+IF(D430=4,0,Startup!$C$4)+IF(E430=6,0,Startup!$C$5)+IF(F430=8,0,Startup!$C$6)+IF(G430=10,0,Startup!$C$7)+IF(H430=12,0,Startup!$C$8)+IF(I430=14,0,Startup!$C$9)","v":0},"No"]
[42.9,0,2,4,6,8,10,12,14,{"$f":"IF(B431=0,0,Startup!$C$2)+IF(C431=2,0,Startup!$C$3)+IF(D431=4,0,Startup!$C$4)+IF(E431=6,0,Startup!$C$5)+IF(F431=8,0,Startup!$C$6)+IF(G431=10,0,Startup!$C$7)+IF(H431=12,0,Startup!$C$8)+IF(I431=14,0,Startup!$C$9)","v":0},"No"]
[43,0,2,4,6,8,10,12,14,{"$f":"IF(B432=0,0,Startup!$C$2)+IF(C432=2,0,Startup!$C$3)+IF(D432=4,0,Startup!$C$4)+IF(E432=6,0,Startup!$C$5)+IF(F432=8,0,Startup!$C$6)+IF(G432=10,0,Startup!$C$7)+IF(H432=12,0,Startup!$C$8)+IF(I432=14,0,Startup!$C$9)","v":0},"No"]
[43.1,0,2,4,6,8,10,12,14,{"$f":"IF(B433=0,0,Startup!$C$2)+IF(C433=2,0,Startup!$C$3)+IF(D433=4,0,Startup!$C$4)+IF(E433=6,0,Startup!$C$5)+IF(F433=8,0,Startup!$C$6)+IF(G433=10,0,Startup!$C$7)+IF(H433=12,0,Startup!$C$8)+IF(I433=14,0,Startup!$C$9)","v":0},"No"]
[43.2,0,2,4,6,8,10,12,14,{"$f":"IF(B434=0,0,Startup!$C$2)+IF(C434=2,0,Startup!$C$3)+IF(D434=4,0,Startup!$C$4)+IF(E434=6,0,Startup!$C$5)+IF(F434=8,0,Startup!$C$6)+IF(G434=10,0,Startup!$C$7)+IF(H434=12,0,Startup!$C$8)+IF(I434=14,0,Startup!$C$9)","v":0},"No"]
[43.3,0,2,4,6,8,10,12,14,{"$f":"IF(B435=0,0,Startup!$C$2)+IF(C435=2,0,Startup!$C$3)+IF(D435=4,0,Startup!$C$4)+IF(E435=6,0,Startup!$C$5)+IF(F435=8,0,Startup!$C$6)+IF(G435=10,0,Startup!$C$7)+IF(H435=12,0,Startup!$C$8)+IF(I435=14,0,Startup!$C$9)","v":0},"No"]
[43.4,0,2,4,6,8,10,12,14,{"$f":"IF(B436=0,0,Startup!$C$2)+IF(C436=2,0,Startup!$C$3)+IF(D436=4,0,Startup!$C$4)+IF(E436=6,0,Startup!$C$5)+IF(F436=8,0,Startup!$C$6)+IF(G436=10,0,Startup!$C$7)+IF(H436=12,0,Startup!$C$8)+IF(I436=14,0,Startup!$C$9)","v":0},"No"]
[43.5,0,2,4,6,8,10,12,14,{"$f":"IF(B437=0,0,Startup!$C$2)+IF(C437=2,0,Startup!$C$3)+IF(D437=4,0,Startup!$C$4)+IF(E437=6,0,Startup!$C$5)+IF(F437=8,0,Startup!$C$6)+IF(G437=10,0,Startup!$C$7)+IF(H437=12,0,Startup!$C$8)+IF(I437=14,0,Startup!$C$9)","v":0},"No"]
[43.6,0,2,4,6,8,10,12,14,{"$f":"IF(B438=0,0,Startup!$C$2)+IF(C438=2,0,Startup!$C$3)+IF(D438=4,0,Startup!$C$4)+IF(E438=6,0,Startup!$C$5)+IF(F438=8,0,Startup!$C$6)+IF(G438=10,0,Startup!$C$7)+IF(H438=12,0,Startup!$C$8)+IF(I438=14,0,Startup!$C$9)","v":0},"No"]
[43.7,0,2,4,6,8,10,12,14,{"$f":"IF(B439=0,0,Startup!$C$2)+IF(C439=2,0,Startup!$C$3)+IF(D439=4,0,Startup!$C$4)+IF(E439=6,0,Startup!$C$5)+IF(F439=8,0,Startup!$C$6)+IF(G439=10,0,Startup!$C$7)+IF(H439=12,0,Startup!$C$8)+IF(I439=14,0,Startup!$C$9)","v":0},"No"]
[43.8,0,2,4,6,8,10,12,14,{"$f":"IF(B440=0,0,Startup!$C$2)+IF(C440=2,0,Startup!$C$3)+IF(D440=4,0,Startup!$C$4)+IF(E440=6,0,Startup!$C$5)+IF(F440=8,0,Startup!$C$6)+IF(G440=10,0,Startup!$C$7)+IF(H440=12,0,Startup!$C$8)+IF(I440=14,0,Startup!$C$9)","v":0},"No"]
[43.9,0,2,4,6,8,10,12,14,{"$f":"IF(B441=0,0,Startup!$C$2)+IF(C441=2,0,Startup!$C$3)+IF(D441=4,0,Startup!$C$4)+IF(E441=6,0,Startup!$C$5)+IF(F441=8,0,Startup!$C$6)+IF(G441=10,0,Startup!$C$7)+IF(H441=12,0,Startup!$C$8)+IF(I441=14,0,Startup!$C$9)","v":0},"No"]
[44,0,2,4,6,8,10,12,14,{"$f":"IF(B442=0,0,Startup!$C$2)+IF(C442=2,0,Startup!$C$3)+IF(D442=4,0,Startup!$C$4)+IF(E442=6,0,Startup!$C$5)+IF(F442=8,0,Startup!$C$6)+IF(G442=10,0,Startup!$C$7)+IF(H442=12,0,Startup!$C$8)+IF(I442=14,0,Startup!$C$9)","v":0},"No"]
[44.1,0,2,4,6,8,10,12,14,{"$f":"IF(B443=0,0,Startup!$C$2)+IF(C443=2,0,Startup!$C$3)+IF(D443=4,0,Startup!$C$4)+IF(E443=6,0,Startup!$C$5)+IF(F443=8,0,Startup!$C$6)+IF(G443=10,0,Startup!$C$7)+IF(H443=12,0,Startup!$C$8)+IF(I443=14,0,Startup!$C$9)","v":0},"No"]
[44.2,0,2,4,6,8,10,12,14,{"$f":"IF(B444=0,0,Startup!$C$2)+IF(C444=2,0,Startup!$C$3)+IF(D444=4,0,Startup!$C$4)+IF(E444=6,0,Startup!$C$5)+IF(F444=8,0,Startup!$C$6)+IF(G444=10,0,Startup!$C$7)+IF(H444=12,0,Startup!$C$8)+IF(I444=14,0,Startup!$C$9)","v":0},"No"]
[44.3,0,2,4,6,8,10,12,14,{"$f":"IF(B445=0,0,Startup!$C$2)+IF(C445=2,0,Startup!$C$3)+IF(D445=4,0,Startup!$C$4)+IF(E445=6,0,Startup!$C$5)+IF(F445=8,0,Startup!$C$6)+IF(G445=10,0,Startup!$C$7)+IF(H445=12,0,Startup!$C$8)+IF(I445=14,0,Startup!$C$9)","v":0},"No"]
[44.4,0,2,4,6,8,10,12,14,{"$f":"IF(B446=0,0,Startup!$C$2)+IF(C446=2,0,Startup!$C$3)+IF(D446=4,0,Startup!$C$4)+IF(E446=6,0,Startup!$C$5)+IF(F446=8,0,Startup!$C$6)+IF(G446=10,0,Startup!$C$7)+IF(H446=12,0,Startup!$C$8)+IF(I446=14,0,Startup!$C$9)","v":0},"No"]
[44.5,0,2,4,6,8,10,12,14,{"$f":"IF(B447=0,0,Startup!$C$2)+IF(C447=2,0,Startup!$C$3)+IF(D447=4,0,Startup!$C$4)+IF(E447=6,0,Startup!$C$5)+IF(F447=8,0,Startup!$C$6)+IF(G447=10,0,Startup!$C$7)+IF(H447=12,0,Startup!$C$8)+IF(I447=14,0,Startup!$C$9)","v":0},"No"]
[44.6,0,2,4,6,8,10,12,14,{"$f":"IF(B448=0,0,Startup!$C$2)+IF(C448=2,0,Startup!$C$3)+IF(D448=4,0,Startup!$C$4)+IF(E448=6,0,Startup!$C$5)+IF(F448=8,0,Startup!$C$6)+IF(G448=10,0,Startup!$C$7)+IF(H448=12,0,Startup!$C$8)+IF(I448=14,0,Startup!$C$9)","v":0},"No"]
[44.7,0,2,4,6,8,10,12,14,{"$f":"IF(B449=0,0,Startup!$C$2)+IF(C449=2,0,Startup!$C$3)+IF(D449=4,0,Startup!$C$4)+IF(E449=6,0,Startup!$C$5)+IF(F449=8,0,Startup!$C$6)+IF(G449=10,0,Startup!$C$7)+IF(H449=12,0,Startup!$C$8)+IF(I449=14,0,Startup!$C$9)","v":0},"No"]
[44.8,0,2,4,6,8,10,12,14,{"$f":"IF(B450=0,0,Startup!$C$2)+IF(C450=2,0,Startup!$C$3)+IF(D450=4,0,Startup!$C$4)+IF(E450=6,0,Startup!$C$5)+IF(F450=8,0,Startup!$C$6)+IF(G450=10,0,Startup!$C$7)+IF(H450=12,0,Startup!$C$8)+IF(I450=14,0,Startup!$C$9)","v":0},"No"]
[44.9,0,2,4,6,8,10,12,14,{"$f":"IF(B451=0,0,Startup!$C$2)+IF(C451=2,0,Startup!$C$3)+IF(D451=4,0,Startup!$C$4)+IF(E451=6,0,Startup!$C$5)+IF(F451=8,0,Startup!$C$6)+IF(G451=10,0,Startup!$C$7)+IF(H451=12,0,Startup!$C$8)+IF(I451=14,0,Startup!$C$9)","v":0},"No"]
[45,0,2,4,6,8,10,12,14,{"$f":"IF(B452=0,0,Startup!$C$2)+IF(C452=2,0,Startup!$C$3)+IF(D452=4,0,Startup!$C$4)+IF(E452=6,0,Startup!$C$5)+IF(F452=8,0,Startup!$C$6)+IF(G452=10,0,Startup!$C$7)+IF(H452=12,0,Startup!$C$8)+IF(I452=14,0,Startup!$C$9)","v":0},{"$f":"IF(J452<>J451,\"Yes\",\"No\")","v":"No"}]
[45.1,0,2,4,6,8,10,12,14,{"$f":"IF(B453=0,0,Startup!$C$2)+IF(C453=2,0,Startup!$C$3)+IF(D453=4,0,Startup!$C$4)+IF(E453=6,0,Startup!$C$5)+IF(F453=8,0,Startup!$C$6)+IF(G453=10,0,Startup!$C$7)+IF(H453=12,0,Startup!$C$8)+IF(I453=14,0,Startup!$C$9)","v":0},"No"]
[45.2,0,2,4,6,8,10,12,14,{"$f":"IF(B454=0,0,Startup!$C$2)+IF(C454=2,0,Startup!$C$3)+IF(D454=4,0,Startup!$C$4)+IF(E454=6,0,Startup!$C$5)+IF(F454=8,0,Startup!$C$6)+IF(G454=10,0,Startup!$C$7)+IF(H454=12,0,Startup!$C$8)+IF(I454=14,0,Startup!$C$9)","v":0},"No"]
[45.3,0,2,4,6,8,10,12,14,{"$f":"IF(B455=0,0,Startup!$C$2)+IF(C455=2,0,Startup!$C$3)+IF(D455=4,0,Startup!$C$4)+IF(E455=6,0,Startup!$C$5)+IF(F455=8,0,Startup!$C$6)+IF(G455=10,0,Startup!$C$7)+IF(H455=12,0,Startup!$C$8)+IF(I455=14,0,Startup!$C$9)","v":0},"No"]
[45.4,0,2,4,6,8,10,12,14,{"$f":"IF(B456=0,0,Startup!$C$2)+IF(C456=2,0,Startup!$C$3)+IF(D456=4,0,Startup!$C$4)+IF(E456=6,0,Startup!$C$5)+IF(F456=8,0,Startup!$C$6)+IF(G456=10,0,Startup!$C$7)+IF(H456=12,0,Startup!$C$8)+IF(I456=14,0,Startup!$C$9)","v":0},"No"]
[45.5,0,2,4,6,8,10,12,14,{"$f":"IF(B457=0,0,Startup!$C$2)+IF(C457=2,0,Startup!$C$3)+IF(D457=4,0,Startup!$C$4)+IF(E457=6,0,Startup!$C$5)+IF(F457=8,0,Startup!$C$6)+IF(G457=10,0,Startup!$C$7)+IF(H457=12,0,Startup!$C$8)+IF(I457=14,0,Startup!$C$9)","v":0},"No"]
[45.6,0,2,4,6,8,10,12,14,{"$f":"IF(B458=0,0,Startup!$C$2)+IF(C458=2,0,Startup!$C$3)+IF(D458=4,0,Startup!$C$4)+IF(E458=6,0,Startup!$C$5)+IF(F458=8,0,Startup!$C$6)+IF(G458=10,0,Startup!$C$7)+IF(H458=12,0,Startup!$C$8)+IF(I458=14,0,Startup!$C$9)","v":0},"No"]
[45.7,0,2,4,6,8,10,12,14,{"$f":"IF(B459=0,0,Startup!$C$2)+IF(C459=2,0,Startup!$C$3)+IF(D459=4,0,Startup!$C$4)+IF(E459=6,0,Startup!$C$5)+IF(F459=8,0,Startup!$C$6)+IF(G459=10,0,Startup!$C$7)+IF(H459=12,0,Startup!$C$8)+IF(I459=14,0,Startup!$C$9)","v":0},"No"]
[45.8,0,2,4,6,8,10,12,14,{"$f":"IF(B460=0,0,Startup!$C$2)+IF(C460=2,0,Startup!$C$3)+IF(D460=4,0,Startup!$C$4)+IF(E460=6,0,Startup!$C$5)+IF(F460=8,0,Startup!$C$6)+IF(G460=10,0,Startup!$C$7)+IF(H460=12,0,Startup!$C$8)+IF(I460=14,0,Startup!$C$9)","v":0},"No"]
[45.9,0,2,4,6,8,10,12,14,{"$f":"IF(B461=0,0,Startup!$C$2)+IF(C461=2,0,Startup!$C$3)+IF(D461=4,0,Startup!$C$4)+IF(E461=6,0,Startup!$C$5)+IF(F461=8,0,Startup!$C$6)+IF(G461=10,0,Startup!$C$7)+IF(H461=12,0,Startup!$C$8)+IF(I461=14,0,Startup!$C$9)","v":0},"No"]
[46,0,2,4,6,8,10,12,14,{"$f":"IF(B462=0,0,Startup!$C$2)+IF(C462=2,0,Startup!$C$3)+IF(D462=4,0,Startup!$C$4)+IF(E462=6,0,Startup!$C$5)+IF(F462=8,0,Startup!$C$6)+IF(G462=10,0,Startup!$C$7)+IF(H462=12,0,Startup!$C$8)+IF(I462=14,0,Startup!$C$9)","v":0},"No"]
[46.1,0,2,4,6,8,10,12,14,{"$f":"IF(B463=0,0,Startup!$C$2)+IF(C463=2,0,Startup!$C$3)+IF(D463=4,0,Startup!$C$4)+IF(E463=6,0,Startup!$C$5)+IF(F463=8,0,Startup!$C$6)+IF(G463=10,0,Startup!$C$7)+IF(H463=12,0,Startup!$C$8)+IF(I463=14,0,Startup!$C$9)","v":0},"No"]
[46.2,0,2,4,6,8,10,12,14,{"$f":"IF(B464=0,0,Startup!$C$2)+IF(C464=2,0,Startup!$C$3)+IF(D464=4,0,Startup!$C$4)+IF(E464=6,0,Startup!$C$5)+IF(F464=8,0,Startup!$C$6)+IF(G464=10,0,Startup!$C$7)+IF(H464=12,0,Startup!$C$8)+IF(I464=14,0,Startup!$C$9)","v":0},"No"]
[46.3,0,2,4,6,8,10,12,14,{"$f":"IF(B465=0,0,Startup!$C$2)+IF(C465=2,0,Startup!$C$3)+IF(D465=4,0,Startup!$C$4)+IF(E465=6,0,Startup!$C$5)+IF(F465=8,0,Startup!$C$6)+IF(G465=10,0,Startup!$C$7)+IF(H465=12,0,Startup!$C$8)+IF(I465=14,0,Startup!$C$9)","v":0},"No"]
[46.4,0,2,4,6,8,10,12,14,{"$f":"IF(B466=0,0,Startup!$C$2)+IF(C466=2,0,Startup!$C$3)+IF(D466=4,0,Startup!$C$4)+IF(E466=6,0,Startup!$C$5)+IF(F466=8,0,Startup!$C$6)+IF(G466=10,0,Startup!$C$7)+IF(H466=12,0,Startup!$C$8)+IF(I466=14,0,Startup!$C$9)","v":0},"No"]
[46.5,0,2,4,6,8,10,12,14,{"$f":"IF(B467=0,0,Startup!$C$2)+IF(C467=2,0,Startup!$C$3)+IF(D467=4,0,Startup!$C$4)+IF(E467=6,0,Startup!$C$5)+IF(F467=8,0,Startup!$C$6)+IF(G467=10,0,Startup!$C$7)+IF(H467=12,0,Startup!$C$8)+IF(I467=14,0,Startup!$C$9)","v":0},"No"]
[46.6,0,2,4,6,8,10,12,14,{"$f":"IF(B468=0,0,Startup!$C$2)+IF(C468=2,0,Startup!$C$3)+IF(D468=4,0,Startup!$C$4)+IF(E468=6,0,Startup!$C$5)+IF(F468=8,0,Startup!$C$6)+IF(G468=10,0,Startup!$C$7)+IF(H468=12,0,Startup!$C$8)+IF(I468=14,0,Startup!$C$9)","v":0},"No"]
[46.7,0,2,4,6,8,10,12,14,{"$f":"IF(B469=0,0,Startup!$C$2)+IF(C469=2,0,Startup!$C$3)+IF(D469=4,0,Startup!$C$4)+IF(E469=6,0,Startup!$C$5)+IF(F469=8,0,Startup!$C$6)+IF(G469=10,0,Startup!$C$7)+IF(H469=12,0,Startup!$C$8)+IF(I469=14,0,Startup!$C$9)","v":0},"No"]
[46.8,0,2,4,6,8,10,12,14,{"$f":"IF(B470=0,0,Startup!$C$2)+IF(C470=2,0,Startup!$C$3)+IF(D470=4,0,Startup!$C$4)+IF(E470=6,0,Startup!$C$5)+IF(F470=8,0,Startup!$C$6)+IF(G470=10,0,Startup!$C$7)+IF(H470=12,0,Startup!$C$8)+IF(I470=14,0,Startup!$C$9)","v":0},"No"]
[46.9,0,2,4,6,8,10,12,14,{"$f":"IF(B471=0,0,Startup!$C$2)+IF(C471=2,0,Startup!$C$3)+IF(D471=4,0,Startup!$C$4)+IF(E471=6,0,Startup!$C$5)+IF(F471=8,0,Startup!$C$6)+IF(G471=10,0,Startup!$C$7)+IF(H471=12,0,Startup!$C$8)+IF(I471=14,0,Startup!$C$9)","v":0},"No"]
[47,0,2,4,6,8,10,12,14,{"$f":"IF(B472=0,0,Startup!$C$2)+IF(C472=2,0,Startup!$C$3)+IF(D472=4,0,Startup!$C$4)+IF(E472=6,0,Startup!$C$5)+IF(F472=8,0,Startup!$C$6)+IF(G472=10,0,Startup!$C$7)+IF(H472=12,0,Startup!$C$8)+IF(I472=14,0,Startup!$C$9)","v":0},"No"]
[47.1,0,2,4,6,8,10,12,14,{"$f":"IF(B473=0,0,Startup!$C$2)+IF(C473=2,0,Startup!$C$3)+IF(D473=4,0,Startup!$C$4)+IF(E473=6,0,Startup!$C$5)+IF(F473=8,0,Startup!$C$6)+IF(G473=10,0,Startup!$C$7)+IF(H473=12,0,Startup!$C$8)+IF(I473=14,0,Startup!$C$9)","v":0},"No"]
[47.2,0,2,4,6,8,10,12,14,{"$f":"IF(B474=0,0,Startup!$C$2)+IF(C474=2,0,Startup!$C$3)+IF(D474=4,0,Startup!$C$4)+IF(E474=6,0,Startup!$C$5)+IF(F474=8,0,Startup!$C$6)+IF(G474=10,0,Startup!$C$7)+IF(H474=12,0,Startup!$C$8)+IF(I474=14,0,Startup!$C$9)","v":0},"No"]
[47.3,0,2,4,6,8,10,12,14,{"$f":"IF(B475=0,0,Startup!$C$2)+IF(C475=2,0,Startup!$C$3)+IF(D475=4,0,Startup!$C$4)+IF(E475=6,0,Startup!$C$5)+IF(F475=8,0,Startup!$C$6)+IF(G475=10,0,Startup!$C$7)+IF(H475=12,0,Startup!$C$8)+IF(I475=14,0,Startup!$C$9)","v":0},"No"]
[47.4,0,2,4,6,8,10,12,14,{"$f":"IF(B476=0,0,Startup!$C$2)+IF(C476=2,0,Startup!$C$3)+IF(D476=4,0,Startup!$C$4)+IF(E476=6,0,Startup!$C$5)+IF(F476=8,0,Startup!$C$6)+IF(G476=10,0,Startup!$C$7)+IF(H476=12,0,Startup!$C$8)+IF(I476=14,0,Startup!$C$9)","v":0},"No"]
[47.5,0,2,4,6,8,10,12,14,{"$f":"IF(B477=0,0,Startup!$C$2)+IF(C477=2,0,Startup!$C$3)+IF(D477=4,0,Startup!$C$4)+IF(E477=6,0,Startup!$C$5)+IF(F477=8,0,Startup!$C$6)+IF(G477=10,0,Startup!$C$7)+IF(H477=12,0,Startup!$C$8)+IF(I477=14,0,Startup!$C$9)","v":0},"No"]
[47.6,0,2,4,6,8,10,12,14,{"$f":"IF(B478=0,0,Startup!$C$2)+IF(C478=2,0,Startup!$C$3)+IF(D478=4,0,Startup!$C$4)+IF(E478=6,0,Startup!$C$5)+IF(F478=8,0,Startup!$C$6)+IF(G478=10,0,Startup!$C$7)+IF(H478=12,0,Startup!$C$8)+IF(I478=14,0,Startup!$C$9)","v":0},"No"]
[47.7,0,2,4,6,8,10,12,14,{"$f":"IF(B479=0,0,Startup!$C$2)+IF(C479=2,0,Startup!$C$3)+IF(D479=4,0,Startup!$C$4)+IF(E479=6,0,Startup!$C$5)+IF(F479=8,0,Startup!$C$6)+IF(G479=10,0,Startup!$C$7)+IF(H479=12,0,Startup!$C$8)+IF(I479=14,0,Startup!$C$9)","v":0},"No"]
[47.8,0,2,4,6,8,10,12,14,{"$f":"IF(B480=0,0,Startup!$C$2)+IF(C480=2,0,Startup!$C$3)+IF(D480=4,0,Startup!$C$4)+IF(E480=6,0,Startup!$C$5)+IF(F480=8,0,Startup!$C$6)+IF(G480=10,0,Startup!$C$7)+IF(H480=12,0,Startup!$C$8)+IF(I480=14,0,Startup!$C$9)","v":0},"No"]
[47.9,0,2,4,6,8,10,12,14,{"$f":"IF(B481=0,0,Startup!$C$2)+IF(C481=2,0,Startup!$C$3)+IF(D481=4,0,Startup!$C$4)+IF(E481=6,0,Startup!$C$5)+IF(F481=8,0,Startup!$C$6)+IF(G481=10,0,Startup!$C$7)+IF(H481=12,0,Startup!$C$8)+IF(I481=14,0,Startup!$C$9)","v":0},"No"]
[48,0,2,4,6,8,10,12,14,{"$f":"IF(B482=0,0,Startup!$C$2)+IF(C482=2,0,Startup!$C$3)+IF(D482=4,0,Startup!$C$4)+IF(E482=6,0,Startup!$C$5)+IF(F482=8,0,Startup!$C$6)+IF(G482=10,0,Startup!$C$7)+IF(H482=12,0,Startup!$C$8)+IF(I482=14,0,Startup!$C$9)","v":0},"No"]
[48.1,0,2,4,6,8,10,12,14,{"$f":"IF(B483=0,0,Startup!$C$2)+IF(C483=2,0,Startup!$C$3)+IF(D483=4,0,Startup!$C$4)+IF(E483=6,0,Startup!$C$5)+IF(F483=8,0,Startup!$C$6)+IF(G483=10,0,Startup!$C$7)+IF(H483=12,0,Startup!$C$8)+IF(I483=14,0,Startup!$C$9)","v":0},"No"]
[48.2,0,2,4,6,8,10,12,14,{"$f":"IF(B484=0,0,Startup!$C$2)+IF(C484=2,0,Startup!$C$3)+IF(D484=4,0,Startup!$C$4)+IF(E484=6,0,Startup!$C$5)+IF(F484=8,0,Startup!$C$6)+IF(G484=10,0,Startup!$C$7)+IF(H484=12,0,Startup!$C$8)+IF(I484=14,0,Startup!$C$9)","v":0},"No"]
[48.3,0,2,4,6,8,10,12,14,{"$f":"IF(B485=0,0,Startup!$C$2)+IF(C485=2,0,Startup!$C$3)+IF(D485=4,0,Startup!$C$4)+IF(E485=6,0,Startup!$C$5)+IF(F485=8,0,Startup!$C$6)+IF(G485=10,0,Startup!$C$7)+IF(H485=12,0,Startup!$C$8)+IF(I485=14,0,Startup!$C$9)","v":0},"No"]
[48.4,0,2,4,6,8,10,12,14,{"$f":"IF(B486=0,0,Startup!$C$2)+IF(C486=2,0,Startup!$C$3)+IF(D486=4,0,Startup!$C$4)+IF(E486=6,0,Startup!$C$5)+IF(F486=8,0,Startup!$C$6)+IF(G486=10,0,Startup!$C$7)+IF(H486=12,0,Startup!$C$8)+IF(I486=14,0,Startup!$C$9)","v":0},"No"]
[48.5,0,2,4,6,8,10,12,14,{"$f":"IF(B487=0,0,Startup!$C$2)+IF(C487=2,0,Startup!$C$3)+IF(D487=4,0,Startup!$C$4)+IF(E487=6,0,Startup!$C$5)+IF(F487=8,0,Startup!$C$6)+IF(G487=10,0,Startup!$C$7)+IF(H487=12,0,Startup!$C$8)+IF(I487=14,0,Startup!$C$9)","v":0},"No"]
[48.6,0,2,4,6,8,10,12,14,{"$f":"IF(B488=0,0,Startup!$C$2)+IF(C488=2,0,Startup!$C$3)+IF(D488=4,0,Startup!$C$4)+IF(E488=6,0,Startup!$C$5)+IF(F488=8,0,Startup!$C$6)+IF(G488=10,0,Startup!$C$7)+IF(H488=12,0,Startup!$C$8)+IF(I488=14,0,Startup!$C$9)","v":0},"No"]
[48.7,0,2,4,6,8,10,12,14,{"$f":"IF(B489=0,0,Startup!$C$2)+IF(C489=2,0,Startup!$C$3)+IF(D489=4,0,Startup!$C$4)+IF(E489=6,0,Startup!$C$5)+IF(F489=8,0,Startup!$C$6)+IF(G489=10,0,Startup!$C$7)+IF(H489=12,0,Startup!$C$8)+IF(I489=14,0,Startup!$C$9)","v":0},"No"]
[48.8,0,2,4,6,8,10,12,14,{"$f":"IF(B490=0,0,Startup!$C$2)+IF(C490=2,0,Startup!$C$3)+IF(D490=4,0,Startup!$C$4)+IF(E490=6,0,Startup!$C$5)+IF(F490=8,0,Startup!$C$6)+IF(G490=10,0,Startup!$C$7)+IF(H490=12,0,Startup!$C$8)+IF(I490=14,0,Startup!$C$9)","v":0},"No"]
[48.9,0,2,4,6,8,10,12,14,{"$f":"IF(B491=0,0,Startup!$C$2)+IF(C491=2,0,Startup!$C$3)+IF(D491=4,0,Startup!$C$4)+IF(E491=6,0,Startup!$C$5)+IF(F491=8,0,Startup!$C$6)+IF(G491=10,0,Startup!$C$7)+IF(H491=12,0,Startup!$C$8)+IF(I491=14,0,Startup!$C$9)","v":0},"No"]
[49,0,2,4,6,8,10,12,14,{"$f":"IF(B492=0,0,Startup!$C$2)+IF(C492=2,0,Startup!$C$3)+IF(D492=4,0,Startup!$C$4)+IF(E492=6,0,Startup!$C$5)+IF(F492=8,0,Startup!$C$6)+IF(G492=10,0,Startup!$C$7)+IF(H492=12,0,Startup!$C$8)+IF(I492=14,0,Startup!$C$9)","v":0},"No"]
[49.1,0,2,4,6,8,10,12,14,{"$f":"IF(B493=0,0,Startup!$C$2)+IF(C493=2,0,Startup!$C$3)+IF(D493=4,0,Startup!$C$4)+IF(E493=6,0,Startup!$C$5)+IF(F493=8,0,Startup!$C$6)+IF(G493=10,0,Startup!$C$7)+IF(H493=12,0,Startup!$C$8)+IF(I493=14,0,Startup!$C$9)","v":0},"No"]
[49.2,0,2,4,6,8,10,12,14,{"$f":"IF(B494=0,0,Startup!$C$2)+IF(C494=2,0,Startup!$C$3)+IF(D494=4,0,Startup!$C$4)+IF(E494=6,0,Startup!$C$5)+IF(F494=8,0,Startup!$C$6)+IF(G494=10,0,Startup!$C$7)+IF(H494=12,0,Startup!$C$8)+IF(I494=14,0,Startup!$C$9)","v":0},"No"]
[49.3,0,2,4,6,8,10,12,14,{"$f":"IF(B495=0,0,Startup!$C$2)+IF(C495=2,0,Startup!$C$3)+IF(D495=4,0,Startup!$C$4)+IF(E495=6,0,Startup!$C$5)+IF(F495=8,0,Startup!$C$6)+IF(G495=10,0,Startup!$C$7)+IF(H495=12,0,Startup!$C$8)+IF(I495=14,0,Startup!$C$9)","v":0},"No"]
[49.4,0,2,4,6,8,10,12,14,{"$f":"IF(B496=0,0,Startup!$C$2)+IF(C496=2,0,Startup!$C$3)+IF(D496=4,0,Startup!$C$4)+IF(E496=6,0,Startup!$C$5)+IF(F496=8,0,Startup!$C$6)+IF(G496=10,0,Startup!$C$7)+IF(H496=12,0,Startup!$C$8)+IF(I496=14,0,Startup!$C$9)","v":0},"No"]
[49.5,0,2,4,6,8,10,12,14,{"$f":"IF(B497=0,0,Startup!$C$2)+IF(C497=2,0,Startup!$C$3)+IF(D497=4,0,Startup!$C$4)+IF(E497=6,0,Startup!$C$5)+IF(F497=8,0,Startup!$C$6)+IF(G497=10,0,Startup!$C$7)+IF(H497=12,0,Startup!$C$8)+IF(I497=14,0,Startup!$C$9)","v":0},"No"]
[49.6,0,2,4,6,8,10,12,14,{"$f":"IF(B498=0,0,Startup!$C$2)+IF(C498=2,0,Startup!$C$3)+IF(D498=4,0,Startup!$C$4)+IF(E498=6,0,Startup!$C$5)+IF(F498=8,0,Startup!$C$6)+IF(G498=10,0,Startup!$C$7)+IF(H498=12,0,Startup!$C$8)+IF(I498=14,0,Startup!$C$9)","v":0},"No"]
[49.7,0,2,4,6,8,10,12,14,{"$f":"IF(B499=0,0,Startup!$C$2)+IF(C499=2,0,Startup!$C$3)+IF(D499=4,0,Startup!$C$4)+IF(E499=6,0,Startup!$C$5)+IF(F499=8,0,Startup!$C$6)+IF(G499=10,0,Startup!$C$7)+IF(H499=12,0,Startup!$C$8)+IF(I499=14,0,Startup!$C$9)","v":0},"No"]
[49.8,0,2,4,6,8,10,12,14,{"$f":"IF(B500=0,0,Startup!$C$2)+IF(C500=2,0,Startup!$C$3)+IF(D500=4,0,Startup!$C$4)+IF(E500=6,0,Startup!$C$5)+IF(F500=8,0,Startup!$C$6)+IF(G500=10,0,Startup!$C$7)+IF(H500=12,0,Startup!$C$8)+IF(I500=14,0,Startup!$C$9)","v":0},"No"]
[49.9,0,2,4,6,8,10,12,14,{"$f":"IF(B501=0,0,Startup!$C$2)+IF(C501=2,0,Startup!$C$3)+IF(D501=4,0,Startup!$C$4)+IF(E501=6,0,Startup!$C$5)+IF(F501=8,0,Startup!$C$6)+IF(G501=10,0,Startup!$C$7)+IF(H501=12,0,Startup!$C$8)+IF(I501=14,0,Startup!$C$9)","v":0},"No"]

{"sheet":"Assemble","index":4,"n_rows":3,"n_cols":4,"rows_kept":3,"cut":false,"hidden":false,"merged":[]}
["Switch state",null,"Startup sequence","0x0600"]
["On",null,"Shutdown sequence","0x0700"]
["Off"]

{"sheet":"Asm","index":5,"n_rows":28,"n_cols":1,"rows_kept":28,"cut":false,"hidden":false,"merged":[]}
["startup_seq    ADDWF  PCL"]
["        dt      0x00, 0x01"]
["        dt      0x01, 0x09"]
["        dt      0x0B, 0x28"]
["        dt      0x1B, 0x1E"]
["        dt      0x0B, 0x78"]
["        dt      0x09, 0x0A"]
["        dt      0x89, 0x8C"]
["        dt      0xA9, 0x05"]
["        dt      0x89, 0x05"]
["        dt      0xC9, 0x05"]
["        dt      0x89, 0x05"]
["        dt      0xC9, 0x05"]
["        dt      0x89, 0x05"]
["        dt      0xA9, 0x05"]
["        dt      0x89, 0xFF"]
[]
["shutdown_seq    ADDWF  PCL"]
["        dt      0x89, 0x05"]
["        dt      0x09, 0x05"]
["        dt      0x0D, 0x0A"]
["        dt      0x1D, 0x1E"]
["        dt      0x0D, 0x1E"]
["        dt      0x05, 0x78"]
["        dt      0x01, 0x0A"]
["        dt      0x00, 0xFF"]
[]
["end of code"]